{"text_format":"1","workbook":"xlsx","n_sheets":22,"sheets":["Home","Report - Electricity","Report - Stationary Fuel Use","Report - Transportation","Report - Total Energy Use","Report - Water Use","Report - Waste and Recycling","Report - GHGs","Electricity Use","Stationary Fuel Use","Transportation","Total Energy Use","Sust.Buildings & Infrastructure","Water Use","Waste and Recycling","Greenhouse Gas Emissions","ExportDataTable","Monthly Collection Waste","Carbon Emission Report Details","Energy Data (imported)","Market-based calc","Admin"],"not_rendered":{"charts":0,"images":3,"macros":1,"external_links":0,"defined_names":49,"comments":0,"pivot_tables":2},"unopened":[],"bounds":{"document_bytes":16777216,"sheet_cells":100000,"rows_first":2000,"rows_last":500,"rows_between":2000,"halvings":0,"cell_chars":16384,"cell_head_chars":4096},"cells_cut":0,"cells_raw":0,"read":"whole","date_system":"1900"}

{"sheet":"Home","index":0,"n_rows":31,"n_cols":6,"rows_kept":31,"cut":false,"hidden":false,"merged":[[7,1,7,4],[8,1,8,4],[9,1,9,4],[6,1,6,4],[10,1,10,4]]}
[]
[]
[]
["FRD 24 Reporting"]
["1. Specify your agency and reporting period"]
[]
["Agency:"]
["Tier"]
["Reporting Period"]
["Reporting Year"]
{"$rows_left_out":22}
{"sheet":"Report - Electricity","index":1,"n_rows":60,"n_cols":14,"rows_kept":60,"cut":false,"hidden":true,"merged":[[5,1,5,6],[59,3,59,5]]}
[]
[]
[]
[]
[]
[null,{"$f":"Agency&\" | \"&Tier&\" | \"&ReportingPeriod","v":" |  |  - "}]
[]
[null,"<- Back to Home",null,null,null,null,null,null,null,null,null,null,null," "]
[]
[null,"Electricity Use"]
{"$rows_left_out":51}
{"sheet":"Report - Stationary Fuel Use","index":2,"n_rows":38,"n_cols":14,"rows_kept":38,"cut":false,"hidden":true,"merged":[[30,2,30,5],[5,1,5,6]]}
[]
[]
[]
[]
[]
[null,{"$f":"Agency&\" | \"&Tier&\" | \"&ReportingPeriod","v":" |  |  - "}]
[]
[null,"<- Back to Home",null,null,null,null,null,null,null,null,null,null,null," "]
[]
[null,"Stationary Fuel Use"]
{"$rows_left_out":29}
{"sheet":"Report - Transportation","index":3,"n_rows":178,"n_cols":15,"rows_kept":178,"cut":false,"hidden":true,"merged":[[5,1,5,7],[12,2,12,6],[31,2,31,6],[158,2,158,6],[177,2,177,6]]}
[]
[]
[]
[]
[]
[null,{"$f":"Agency&\" | \"&Tier&\" | \"&ReportingPeriod","v":" |  |  - "}]
[]
[null,"<- Back to Home"]
[]
[null,"Transportation"]
{"$rows_left_out":169}
{"sheet":"Report - Total Energy Use","index":4,"n_rows":21,"n_cols":14,"rows_kept":21,"cut":false,"hidden":true,"merged":[[5,1,5,6]]}
[]
[]
[]
[]
[]
[null,{"$f":"Agency&\" | \"&Tier&\" | \"&ReportingPeriod","v":" |  |  - "}]
[]
[null,"<- Back to Home",null,null,null,null,null,null,null,null,null,null,null," "]
[]
[null,"Total Energy Use"]
{"$rows_left_out":12}
{"sheet":"Report - Water Use","index":5,"n_rows":19,"n_cols":14,"rows_kept":19,"cut":false,"hidden":true,"merged":[[5,1,5,6]]}
[]
[]
[]
[]
[]
[null,{"$f":"Agency&\" | \"&Tier&\" | \"&ReportingPeriod","v":" |  |  - "}]
[]
[null,"<- Back to Home",null,null,null,null,null,null,null,null,null,null,null," "]
[]
[null,"Water Use"]
{"$rows_left_out":10}
{"sheet":"Report - Waste and Recycling","index":6,"n_rows":26,"n_cols":20,"rows_kept":26,"cut":false,"hidden":true,"merged":[[22,9,23,12],[15,9,18,19],[13,6,14,6],[5,1,5,5]]}
[]
[]
[]
[]
[]
[null,{"$f":"Agency&\" | \"&Tier&\" | \"&ReportingPeriod","v":" |  |  - "}]
[]
[null,"<- Back to Home","Note: Finalise report (on Home tab) in order to refresh the reports below for WR1 and WR2"]
[]
[null,"Waste and Recycling"]
{"$rows_left_out":17}
{"sheet":"Report - GHGs","index":7,"n_rows":34,"n_cols":14,"rows_kept":34,"cut":false,"hidden":true,"merged":[[5,1,5,6],[31,2,31,5]]}
[]
[]
[]
[]
[]
[null,{"$f":"Agency&\" | \"&Tier&\" | \"&ReportingPeriod","v":" |  |  - "}]
[]
[null,"<- Back to Home",null,null,null,null,null,null,null,null,null,null,null," "]
[]
[null,"Greenhouse Gas Emissions"]
{"$rows_left_out":25}
{"sheet":"Electricity Use","index":8,"n_rows":73,"n_cols":18,"rows_kept":73,"cut":false,"hidden":false,"merged":[[5,1,5,6],[49,2,49,12],[63,2,63,12],[20,2,20,12],[12,2,12,12]]}
[]
[]
[]
[]
[]
[null,{"$f":"Agency&\" | \"&Tier&\" | \"&ReportingPeriod","v":" |  |  - "}]
[]
[null,"<- Back to Home",null,null,null,"Sheet complete:",null,{"$f":"IFERROR(IF(COUNTIF(O:O,\"Pass\")+COUNTIF(O:O,\"FAIL\")=0,\"NA\",IF(VLOOKUP(\"FAIL\",O:O,1,FALSE) = \"FAIL\", IF(COUNTIF(O:O,\"Pass\")=0,\"Not Started\",\"In Progress\"),\"Complete\")),\"Complete\")","v":"NA"}," "]
[null,null,null,null,null,null,null,{"$f":"IF(NOT(OR(H8=\"Complete\",H8=\"NA\")),\"*Mandatory values have not been entered, revisit highlighted items\",\"\")","v":""}]
[null,"Electricity Use - Reporting"]
{"$rows_left_out":64}
{"sheet":"Stationary Fuel Use","index":9,"n_rows":66,"n_cols":21,"rows_kept":66,"cut":false,"hidden":false,"merged":[[5,1,5,6],[48,2,48,12],[12,2,12,12]]}
[]
[]
[]
[]
[]
[null,{"$f":"Agency&\" | \"&Tier&\" | \"&ReportingPeriod","v":" |  |  - "}]
[]
[null,"<- Back to Home",null,null,null,"Sheet complete:",null,{"$f":"IFERROR(IF(COUNTIF(O:O,\"Pass\")+COUNTIF(O:O,\"FAIL\")=0,\"NA\",IF(VLOOKUP(\"FAIL\",O:O,1,FALSE) = \"FAIL\", IF(COUNTIF(O:O,\"Pass\")=0,\"Not Started\",\"In Progress\"),\"Complete\")),\"Complete\")","v":"NA"}," "]
[null,null,null,null,null,null,null,{"$f":"IF(NOT(OR(H8=\"Complete\",H8=\"NA\")),\"*Mandatory values have not been entered, revisit highlighted items\",\"\")","v":""}]
[null,"Stationary Fuel Use - Reporting"]
{"$rows_left_out":57}
{"sheet":"Transportation","index":10,"n_rows":228,"n_cols":22,"rows_kept":228,"cut":false,"hidden":false,"merged":[[5,1,5,6],[58,2,58,12],[178,2,178,12],[224,2,224,12],[12,2,12,12]]}
[]
[]
[]
[]
[]
[null,{"$f":"Agency&\" | \"&Tier&\" | \"&ReportingPeriod","v":" |  |  - "}]
[]
[null,"<- Back to Home",null,null,null,"Sheet complete:",null,{"$f":"IFERROR(IF(COUNTIF(O:O,\"Pass\")+COUNTIF(O:O,\"FAIL\")=0,\"NA\",IF(VLOOKUP(\"FAIL\",O:O,1,FALSE) = \"FAIL\", IF(COUNTIF(O:O,\"Pass\")=0,\"Not Started\",\"In Progress\"),\"Complete\")),\"Complete\")","v":"NA"}," "]
[null,null,null,null,null,null,null,{"$f":"IF(NOT(OR(H8=\"Complete\",H8=\"NA\")),\"*Mandatory values have not been entered, revisit highlighted items\",\"\")","v":""}]
[null,"Transportation - Reporting"]
{"$rows_left_out":219}
{"sheet":"Total Energy Use","index":11,"n_rows":38,"n_cols":17,"rows_kept":38,"cut":false,"hidden":false,"merged":[[5,1,5,6],[25,2,25,12],[32,2,32,12],[12,2,12,12],[19,2,19,12]]}
[]
[]
[]
[]
[]
[null,{"$f":"Agency&\" | \"&Tier&\" | \"&ReportingPeriod","v":" |  |  - "}]
[]
[null,"<- Back to Home",null,null,null,"Sheet complete:",null,{"$f":"IFERROR(IF(COUNTIF(O:O,\"Pass\")+COUNTIF(O:O,\"FAIL\")=0,\"NA\",IF(VLOOKUP(\"FAIL\",O:O,1,FALSE) = \"FAIL\", IF(COUNTIF(O:O,\"Pass\")=0,\"Not Started\",\"In Progress\"),\"Complete\")),\"Complete\")","v":"NA"}," "]
[null,null,null,null,null,null,null,{"$f":"IF(NOT(OR(H8=\"Complete\",H8=\"NA\")),\"*Mandatory values have not been entered, revisit highlighted items\",\"\")","v":""}]
[null,"Total Energy Use - Reporting"]
{"$rows_left_out":29}
{"sheet":"Sust.Buildings & Infrastructure","index":12,"n_rows":34,"n_cols":17,"rows_kept":34,"cut":false,"hidden":false,"merged":[[5,1,5,6],[31,2,31,12],[12,2,12,12],[20,2,20,12]]}
[]
[]
[]
[]
[]
[null,{"$f":"Agency&\" | \"&Tier&\" | \"&ReportingPeriod","v":" |  |  - "}]
[]
[null,"<- Back to Home",null,null,null,"Sheet complete:",null,{"$f":"IFERROR(IF(COUNTIF(O:O,\"Pass\")+COUNTIF(O:O,\"FAIL\")=0,\"NA\",IF(VLOOKUP(\"FAIL\",O:O,1,FALSE) = \"FAIL\", IF(COUNTIF(O:O,\"Pass\")=0,\"Not Started\",\"In Progress\"),\"Complete\")),\"Complete\")","v":"NA"}," "]
[null,null,null,null,null,null,null,{"$f":"IF(NOT(OR(H8=\"Complete\",H8=\"NA\")),\"*Mandatory values have not been entered, revisit highlighted items\",\"\")","v":""}]
[null,"Sustainable Buildings and Infrastructure - Reporting"]
{"$rows_left_out":25}
{"sheet":"Water Use","index":13,"n_rows":27,"n_cols":17,"rows_kept":27,"cut":false,"hidden":false,"merged":[[5,1,5,6],[21,2,21,12],[12,2,12,12]]}
[]
[]
[]
[]
[]
[null,{"$f":"Agency&\" | \"&Tier&\" | \"&ReportingPeriod","v":" |  |  - "}]
[]
[null,"<- Back to Home",null,null,null,"Sheet complete:",null,{"$f":"IFERROR(IF(COUNTIF(O:O,\"Pass\")+COUNTIF(O:O,\"FAIL\")=0,\"NA\",IF(VLOOKUP(\"FAIL\",O:O,1,FALSE) = \"FAIL\", IF(COUNTIF(O:O,\"Pass\")=0,\"Not Started\",\"In Progress\"),\"Complete\")),\"Complete\")","v":"NA"}," "]
[null,null,null,null,null,null,null,{"$f":"IF(NOT(OR(H8=\"Complete\",H8=\"NA\")),\"*Mandatory values have not been entered, revisit highlighted items\",\"\")","v":""}]
[null,"Water Use - Reporting"]
{"$rows_left_out":18}
{"sheet":"Waste and Recycling","index":14,"n_rows":54,"n_cols":18,"rows_kept":54,"cut":false,"hidden":false,"merged":[[5,1,5,6],[40,2,40,12],[47,2,47,12],[12,2,12,12],[23,2,23,12],[32,2,32,12]]}
[]
[]
[]
[]
[]
[null,{"$f":"Agency&\" | \"&Tier&\" | \"&ReportingPeriod","v":" |  |  - "}]
[]
[null,"<- Back to Home",null,null,null,"Sheet complete:",null,{"$f":"IFERROR(IF(COUNTIF(O:O,\"Pass\")+COUNTIF(O:O,\"FAIL\")=0,\"NA\",IF(VLOOKUP(\"FAIL\",O:O,1,FALSE) = \"FAIL\", IF(COUNTIF(O:O,\"Pass\")=0,\"Not Started\",\"In Progress\"),\"Complete\")),\"Complete\")","v":"NA"}," "]
[null,null,null,null,null,null,null,{"$f":"IF(NOT(OR(H8=\"Complete\",H8=\"NA\")),\"*Mandatory values have not been entered, revisit highlighted items\",\"\")","v":""}]
[null,"Waste and Recycling - Reporting"]
{"$rows_left_out":45}
{"sheet":"Greenhouse Gas Emissions","index":15,"n_rows":75,"n_cols":18,"rows_kept":75,"cut":false,"hidden":false,"merged":[[62,2,62,12],[68,2,68,12],[43,2,43,12],[5,1,5,6],[37,2,37,12],[12,2,12,12],[50,2,50,12],[56,2,56,12]]}
[]
[]
[]
[]
[]
[null,{"$f":"Agency&\" | \"&Tier&\" | \"&ReportingPeriod","v":" |  |  - "}]
[]
[null,"<- Back to Home",null,null,null,"Sheet complete:",null,{"$f":"IFERROR(IF(COUNTIF(O:O,\"Pass\")+COUNTIF(O:O,\"FAIL\")=0,\"NA\",IF(VLOOKUP(\"FAIL\",O:O,1,FALSE) = \"FAIL\", IF(COUNTIF(O:O,\"Pass\")=0,\"Not Started\",\"In Progress\"),\"Complete\")),\"Complete\")","v":"NA"}," "]
[null,null,null,null,null,null,null,{"$f":"IF(NOT(OR(H8=\"Complete\",H8=\"NA\")),\"*Mandatory values have not been entered, revisit highlighted items\",\"\")","v":""}]
[null,"Greenhouse Gas Emissions - Reporting"]
{"$rows_left_out":66}
{"sheet":"ExportDataTable","index":16,"n_rows":1,"n_cols":28,"rows_kept":1,"cut":false,"hidden":false,"merged":[]}
["DCT Version Number","Entity","Tier","Reporting Period","Indicator Category","Indicator","Indicator Description","FRDSegment","ID","Parent ID","Segment Level","Description","Flag","Final Value","Final Unit","Input Type","Input Value","Input Unit","Segment Level 1","Segment Level 2","Segment Level 3","Segment Level 4","Segment Level 5","Segment Level 6","Segment Level 7","Segment Level 8","Segment Level 9","Segment Level 10"]

{"sheet":"Monthly Collection Waste","index":17,"n_rows":1,"n_cols":19,"rows_kept":1,"cut":false,"hidden":false,"merged":[]}
["Index ()","Customer Number","Name","Site Name","City","State","Waste Type Description","Serv. Code","Cont. Type","Date","Group","Weight Recorded","Qty. Serviced","Default Weight Per Unit","Default Weight Total","Weight","Volume","Disposal Stream","Waste Stream"]

{"sheet":"Carbon Emission Report Details","index":18,"n_rows":5,"n_cols":24,"rows_kept":5,"cut":false,"hidden":false,"merged":[[0,0,0,7],[1,0,1,7],[2,0,2,7]]}
["Corporate Travel Management - Carbon Emission Report ( Air, Hotel & Car)"]
["Debtor:   Department of Environment, Land, Water and Planning (DELWP)"]
["Date Type: Service Date : 7/1/2020 1 to 6/30/2021 "]
[]
["Client Group","Debtor","Booking Code","Booking Date","Service Date","Last Service Date","PNR","Documentnumber","Traveller Name","Booked By","Card Type","Card Holder","Card Number","Destination Country","Destination City","Itinerary Summary","Unit Count","Mileage","Kilometers","Service Provider","Service Provider Type","Carbon Emission (DEFRA select RF)","Emission Tonnes CO2e","Carbon Offset Cost"]

{"sheet":"Energy Data (imported)","index":19,"n_rows":11,"n_cols":6,"rows_kept":11,"cut":false,"hidden":false,"merged":[]}
[]
[]
["Report Name:","FRD24 Data"]
["Custom Report:","Multi-Service Cost and Usage"]
["Client:","Victorian Government"]
["Level:","Site"]
["Filters:","Separate Estimated and Actual Data:Yes"]
["Date Range:","7/1/2020 to 6/30/2021"]
["Units of Measure:","Currency:AUD, Area:Sq. Ft."]
[]
{"$rows_left_out":2}
{"sheet":"Market-based calc","index":20,"n_rows":19,"n_cols":5,"rows_kept":19,"cut":false,"hidden":true,"merged":[]}
[null,"National Scope 2",{"$f":"Admin!F2","v":0.68}]
[null,"RPP",{"$f":"Admin!F3","v":0.18640000000000001}]
[null,"National RMF scope 2",0.95499999999999996]
[]
[null,"Market Based Approach Summary "]
[null,"Market Based Approach ","Activity Data (kWh)","Emissions \n(kgCO2e)","Renewable Percentage of total "]
[null,"Behind the meter consumption of electricity generated",{"$f":" (  'Electricity Use'!J24 - ('Electricity Use'!J30+'Electricity Use'!J31)-'Electricity Use'!J73  ) * 1000","v":0},{"$f":"$C7*0","v":0},{"$f":"IF(D7<0,0,C7/$C$14)","v":{"$error":"#DIV/0!"}}]
[null,"Total non-grid electricity ",{"$f":"C7","v":0},{"$f":"D7","v":0},{"$f":"SUM(E7)","v":{"$error":"#DIV/0!"}}]
[null,"LGC Purchased and retired (kWh) (including PPAs & Precinct LGCs)",{"$f":"(  'Electricity Use'!J67 + 'Electricity Use'!J68  ) * 1000","v":0},{"$f":"$C9*0","v":0},{"$f":"IF(D9>0,0,C9/$C$14)","v":{"$error":"#DIV/0!"}}]
[null,"GreenPower",{"$f":"'Electricity Use'!J70 * 1000","v":0},{"$f":"$C10*0","v":0},{"$f":"IF(D10>0,0,C10/$C$14)","v":{"$error":"#DIV/0!"}}]
{"$rows_left_out":10}
{"sheet":"Admin","index":21,"n_rows":180,"n_cols":96,"rows_kept":180,"cut":false,"hidden":true,"merged":[[7,4,10,4],[0,69,0,72],[0,88,0,90],[0,4,0,5],[0,7,0,8],[0,16,0,21],[0,23,0,27],[0,63,0,67],[0,82,0,86],[0,42,0,61]]}
["DCT Version Number",null,"Reporting Period",null,"Market-based calculation - adjust values as needed",null,null,"Normalisation Factors",null,null,"Input - Normal","Input - with calc",null,null,"Disposal Stream",null,"Calculations",null,null,null,null,null,null,"Input Units",null,null,null,null,null,null,null,"Indicator","Indicator Title","Currently Selected -DO NOT MODIFY","Indicator Sheet","Tier 1","Tier 2","Tier 3a","Tier 3b","Tier 3s","Tier 4",null,"CONVERSION TABLE",null,null,null,null,null,null,null,null,null,null,null,null,null,null,null,null,null,null,null,null,"Emissions Factors",null,null,null,null,"Update this number from NGA","Cross-Unit Conversions",null,null,null,null,null,null,null,null,null,null,null,null,"B4 & B5 drop-downs",null,null,null,null,null,"HeaderInfo and Helpers for VBA Iteration / Named Ranges",null,null,null,"Column","ExportDataTable Field Name","MapType","MapHelper"]
["v1.01",null,"1 Jan - 31 Dec (Calendar Year)",null,"National Scope 2",0.68,null,"B6","W2 & WR3",null,"Manual","Manual",null,null,"Landfill (disposal)",null,"Indicator ID","Datasheet","Description","Data starts at row #","Data imported?","Formula",null,"G1","F1-KG","F1-Both","F1-Natural Gas","WR-M3",null,"Unit",null,"EL1","Total electricity consumption segmented by source",{"$f":"IF(Tier=\"\",\"\",INDEX(AJ2:AO2,MATCH(Tier,$AJ$1:$AO$1,0)))","v":""},"Electricity Use","Yes","Yes","Yes","Yes","Yes","Yes",null,null,null,null,null,null,null,null,null,null,null,null,null,null,null,null,null,null,null,null,null,null,"Indicator","Type","Concat","Source Unit","Emissions Factor kgCO2-e","Emissions Factor tonnes CO2-e","convFromLitres","convFromKG","convFromM3","convFromKL","GWP","Leakage rate","Emissions Factor kg CO2","Emissions Factor kg CH4","Emissions Factor kg N2O","Emissions Factor tonnes CO2","Emissions Factor tonnes CH4","Emissions Factor tonnes N2O",null,"Rating system","NABERS","Green Star","NatHERS","ISCA",null,"CurrentIndicator","CurrentSheet","CurrentDescription",null,1,"DCT Version Number","val",{"$f":"versionNumber","v":"v1.01"}]
[null,null,"1 Jul - 30 Jun (Financial Year)",null,"RPP",0.18640000000000001,null,"FTE","FTE",null,"Estimate","Estimate",null,null,"Recycling/recovery (disposal)",null,"EL1","Energy Data (imported)","Purchased directly through an electricity retailer",12,{"$f":"INDIRECT(\"'\"&R3&\"'!$A$\"&T3)<>\"\"","v":false},"=SUMIF(INDIRECT(\"'\"&Admin!R$3&\"'!C:C\"), \"Electric Power\",INDIRECT(\"'\"&Admin!R$3&\"'!E:E\"))",null,"Tonnes CO2-e","KWh","KWh","KWh","Tonnes",null,"L",null,"EL2","On site-electricity generated (in megawatt hours) for large-scale renewable energy systems, (i.e. accredited under the Large-Scale Renewable Energy Target (RET)), small-scale renewable energy systems (where data is available), and any other electricity generation system (where data is available), segmented by:","","Electricity Use","Yes","Yes","Yes","Yes","Yes",null,null,null,"Source\\Target","MWh","KWh","KJ","MJ","GJ","TJ","Tonnes","KG","ML (water)","kL (water)","L (water)","Km","m","Miles","MW","KW","Tonnes CO2-e","KG CO2-e",null,"F2","Natural Gas",{"$f":"BL3& \"-\"&BM3","v":"F2-Natural Gas"},"GJ",{"$f":"SUM(BX3:BZ3)","v":51.53},{"$f":"BP3/1000","v":5.1529999999999999E-2},null,null,{"$f":"39.3*(10^-3)","v":3.9299999999999995E-2},null,null,null,51.4,0.1,0.03,{"$f":"BX3/1000","v":5.1400000000000001E-2},{"$f":"BY3/1000","v":1E-4},2.9999999999999997E-5,null,"NABERS Energy",0,4,0,25,null,"G7",{"$f":"VLOOKUP(CurrentIndicator,TierIndicators,4,FALSE)","v":"Greenhouse Gas Emissions"},{"$f":"VLOOKUP(CurrentIndicator,TierIndicators,2,FALSE)","v":"Optional - Net greenhouse gas emissions segmented into scope one (direct), scope two (indirect electricity) and scope three (indirect other) [calculated by total greenhouse gas emissions minus retired offsets] (tonnes CO2-e)"},null,2,"Entity","val",{"$f":"Agency","v":0}]
["NGA Factors (year)",null,"1 Apr - 30 Mar",null,null,null,null,"headcount","headcount",null,"Not Available -> Provide Comment","Not Available -> Provide Comment",null,null,"Other",null,"EL4","Energy Data (imported)","GreenPower or certified carbon neutral electricity purchased (eg. Through a retailer's contract option)",12,{"$f":"INDIRECT(\"'\"&R4&\"'!$A$\"&T4)<>\"\"","v":false},"=SUMIF(INDIRECT(\"'\"&Admin!R$4&\"'!C:C\"), \"Green Power\",INDIRECT(\"'\"&Admin!R$4&\"'!E:E\"))",null,"KG CO2-e","MWh","MWh","MWh","Kg",null,"Tonnes",null,"EL3","On-site installed generation capacity in megawatts (as at end of reporting period) segment by:","","Electricity Use","Yes","Yes","Yes","Yes","Yes",null,null,"Energy","MWh",1,1000,3600000,3600,3.6,3.5999971200023038E-3,null,null,null,null,null,null,null,null,null,null,null,null,null,"F2","LPG",{"$f":"BL4& \"-\"&BM4","v":"F2-LPG"},"GJ",{"$f":"SUM(BX4:BZ4)","v":60.600000000000009},{"$f":"BP4/1000","v":6.0600000000000008E-2},{"$f":"BU4/1000","v":2.5700000000000001E-2},{"$f":"1.96*25.7/1000","v":5.0372E-2},null,25.7,null,null,60.2,0.2,0.2,{"$f":"BX4/1000","v":6.0200000000000004E-2},{"$f":"BY4/1000","v":2.0000000000000001E-4},{"$f":"BZ4/1000","v":2.0000000000000001E-4},null,"NABERS Water",1,5,1,26,null,null,null,null,null,3,"Tier","val",{"$f":"Tier","v":0}]
[2022,null,"Other",null,null,null,null,"floor area (m2)","floor area (m2)",null,null,"Calculation",null,null,null,null,"F1","Energy Data (imported)","Natural gas (buildings)",12,{"$f":"INDIRECT(\"'\"&R5&\"'!$A$\"&T5)<>\"\"","v":false},"=SUMIF(INDIRECT(\"'\"&Admin!R$5&\"'!C:C\"), \"Natural Gas\",INDIRECT(\"'\"&Admin!R$5&\"'!E:E\"))",null,"Tonnes","KJ","KJ","KJ","m3",null,"KG",null,"EL4","Total electricity offsets segmented by offset type","","Electricity Use","Yes","Yes","Yes","Yes","Yes","Yes",null,"Energy","KWh",1E-3,1,3600,3.6,3.5999999999999999E-3,3.5999999999711999E-6,null,null,null,null,null,null,null,null,null,null,null,null,null,"F2","Diesel","F2-Diesel","GJ",70.2,{"$f":"BP5/1000","v":7.0199999999999999E-2},{"$f":"BU5/1000","v":3.8600000000000002E-2},null,null,38.6,null,null,69.900000000000006,0.1,0.2,6.9900000000000004E-2,1E-4,2.0000000000000001E-4,null,"NABERS Indoor Environment",2,6,2,27,null,null,null,null,null,4,"Reporting Period","val",{"$f":"ReportingPeriod","v":" - "}]
[null,null,null,null,null,null,null,"other","other",null,null,null,null,null,null,null,"T4","Carbon Emission Report Details","Total distance travelled by commercial air travel (passenger km travelled for business purposes by entity staff on commercial or charter aircraft)",6,{"$f":"INDIRECT(\"'\"&R6&\"'!$A$\"&T6)<>\"\"","v":false},"=SUMIF(INDIRECT(\"'\"&Admin!R$6&\"'!U:U\"),\"Air Travel\",INDIRECT(\"'\"&Admin!R$6&\"'!S:S\"))",null,"KG","MJ","MJ","MJ",null,null,"m3",null,"F1","Total fuels used in buildings and machinery segmented by fuel type (MJ)","","Stationary Fuel Use","Yes","Yes","Yes","Yes","Yes",null,null,"Energy","KJ",2.7777777777777776E-7,2.7777800000000001E-4,1,1E-3,9.9999999999999995E-7,1.0000000000000001E-9,null,null,null,null,null,null,null,null,null,null,null,null,null,"F2","Petrol","F2-Petrol","GJ",67.800000000000011,{"$f":"BP6/1000","v":6.7800000000000013E-2},3.4200000000000001E-2,null,null,34.200000000000003,null,null,67.400000000000006,0.2,0.2,6.7400000000000002E-2,2.0000000000000001E-4,2.0000000000000001E-4,null,"NABERS Waste",3,null,3,28,null,null,null,null,null,5,"Indicator Category","val",{"$f":"CurrentSheet","v":"Greenhouse Gas Emissions"}]
[null,null,null,null,null,null,null,null,null,null,null,null,null,null,null,null,"G3","Carbon Emission Report Details","Total scope three (other indirect) greenhouse gas emissions associated with commercial air travel (tCO2-e)",6,{"$f":"INDIRECT(\"'\"&R7&\"'!$A$\"&T7)<>\"\"","v":false},"=SUMIF(INDIRECT(\"'\"&Admin!R$7&\"'!U:U\"),\"Air Travel\",INDIRECT(\"'\"&Admin!R$7&\"'!W:W\"))",null,null,"GJ","GJ","GJ",null,null,null,null,"F2","Greenhouse gas emissions from stationary fuel consumption segmented by fuel type (Tonnes CO2-e)","","Stationary Fuel Use","Yes","Yes","Yes","Yes","Yes",null,null,"Energy","MJ",2.7777777777777778E-4,0.27777777777777779,1000,1,1E-3,9.9999999999999995E-7,null,null,null,null,null,null,null,null,null,null,null,null,null,"F2","Hydrogen","F2-Hydrogen","MJ","DIRECT","DIRECT",null,120,null,null,null,null,"DIRECT","DIRECT","DIRECT","DIRECT","DIRECT","DIRECT",null,"Green Star Communities",4,null,4,29,null,null,null,null,null,6,"Indicator","val",{"$f":"CurrentIndicator","v":"G7"}]
[null,null,null,null,"NB - update the RPP here and then use RMFs supplied by Climate Active to update the Market-based calc sheet",null,null,null,null,null,null,null,null,null,null,null,"WR1","Monthly Collection Waste","Total units of waste disposed of by waste stream and disposal method",2,{"$f":"INDIRECT(\"'\"&R8&\"'!$A$\"&T8)<>\"\"","v":false},"=SUMIFS(INDIRECT(\"'\"&Admin!R$8&\"'!O:O\"), INDIRECT(\"'\"&Admin!R$8&\"'!R:R\"),OFFSET(INDIRECT(ADDRESS(ROW(),COLUMN())),0,3),INDIRECT(\"'\"&Admin!R$8&\"'!S:S\"),OFFSET(INDIRECT(ADDRESS(ROW(),COLUMN())),0,-5))",null,null,"TJ","TJ","TJ",null,null,null,null,"T1","Total energy used in transportation within the Entity, segmented by fuel type and vehicle category","","Transportation","Yes","Yes","Yes","Yes","Yes",null,null,"Energy","GJ",0.27777777777777779,277.77800000000002,1000000,1000,1,1E-3,null,null,null,null,null,null,null,null,null,null,null,null,null,"F2","Dry wood","F2-Dry wood","GJ",1.2000000000000002,{"$f":"BP8/1000","v":1.2000000000000001E-3},null,1.6199999999999999E-2,null,null,null,null,0,0.1,1.1000000000000001,0,{"$f":"BY8/1000","v":1E-4},{"$f":"BZ8/1000","v":1.1000000000000001E-3},null,"Green Star Design & As Built",5,null,5,30,null,null,null,null,null,7,"Indicator Description","val",{"$f":"CurrentDescription","v":"Optional - Net greenhouse gas emissions segmented into scope one (direct), scope two (indirect electricity) and scope three (indirect other) [calculated by total greenhouse gas emissions minus retired offsets] (tonnes CO2-e)"}]
[null,null,null,null,null,null,null,null,null,null,null,null,null,null,null,null,null,null,null,null,null,null,null,null,"Kg","L","m3",null,null,null,null,"T2","Number and proportion of vehicles in the organisational boundary segmented by engine/fuel type and vehicle category","","Transportation","Yes","Yes","Yes","Yes","Yes","Yes",null,"Energy","TJ",277.77800000000002,277777.77778,1000000000,1000000,1000,1,null,null,null,null,null,null,null,null,null,null,null,null,null,"F2","Green and air dried wood","F2-Green and air dried wood","GJ",1.2000000000000002,1.2000000000000001E-3,null,1.04E-2,null,null,null,null,0,0.1,1.1000000000000001,{"$f":"BX9/1000","v":0},{"$f":"BY9/1000","v":1E-4},{"$f":"BZ9/1000","v":1.1000000000000001E-3},null,"Green Star Interiors",6,null,6,31,null,null,null,null,null,8,"FRDSegment","cellref",{"$f":"MATCH(CP9,'Electricity Use'!$B$14:$N$14,0)","v":3}]
[null,null,null,null,null,null,null,null,null,null,null,null,null,null,null,null,null,null,null,null,null,null,null,null,"Tonnes","kL",null,null,null,null,null,"T3","Greenhouse gas emissions from vehicle fleet segmented by fuel type and vehicle category (tonnes CO2-e)","","Transportation","Yes","Yes","Yes","Yes","Yes",null,null,"Weight","Tonnes",null,null,null,null,null,null,1,1000,null,null,null,null,null,null,null,null,null,null,null,"F2","Bagasse","F2-Bagasse","GJ",1.4000000000000001,1.4000000000000002E-3,null,9.5999999999999992E-3,null,null,null,null,0,0.3,1.1000000000000001,0,2.9999999999999997E-4,1.1000000000000001E-3,null,"Green Star Performance",null,null,7,32,null,null,null,null,null,9,"ID","cellref",{"$f":"MATCH(CP10,'Electricity Use'!$B$14:$N$14,0)","v":1}]
{"$rows_left_out":170}