{"text_format":"1","workbook":"xlsx","n_sheets":22,"sheets":["Home","Report - Electricity","Report - Stationary Fuel Use","Report - Transportation","Report - Total Energy Use","Report - Water Use","Report - Waste and Recycling","Report - GHGs","Electricity Use","Stationary Fuel Use","Transportation","Total Energy Use","Sust.Buildings & Infrastructure","Water Use","Waste and Recycling","Greenhouse Gas Emissions","ExportDataTable","Monthly Collection Waste","Carbon Emission Report Details","Energy Data (imported)","Market-based calc","Admin"],"not_rendered":{"charts":0,"images":3,"macros":1,"external_links":0,"defined_names":49,"comments":0,"pivot_tables":2},"unopened":[],"bounds":{"document_bytes":16777216,"sheet_cells":100000,"rows_first":2000,"rows_last":500,"rows_between":2000,"halvings":0,"cell_chars":16384,"cell_head_chars":4096},"cells_cut":0,"cells_raw":0,"read":"whole","date_system":"1900"}

{"sheet":"Home","index":0,"n_rows":31,"n_cols":6,"rows_kept":31,"cut":false,"hidden":false,"merged":[[7,1,7,4],[8,1,8,4],[9,1,9,4],[6,1,6,4],[10,1,10,4]]}
[]
[]
[]
["FRD 24 Reporting"]
["1. Specify your agency and reporting period"]
[]
["Agency:"]
["Tier"]
["Reporting Period"]
["Reporting Year"]
["Reporting for",{"$f":"_xlfn.CONCAT(B9,\" - \", B10)","v":" - "}]
[]
["2. Import data files (optional)"]
[]
[{"$f":"HYPERLINK(\"#'Energy Data (imported)'!A1\",\"Energy Data (F1, EL1, EL4)\")","v":"Energy Data (F1, EL1, EL4)"},null,"Export report from Resource Advisor",null,null,"Imported date:"]
[{"$f":"HYPERLINK(\"#'Carbon Emission Report Details'!A1\",\"Carbon Emission Report (T4, G3)\")","v":"Carbon Emission Report (T4, G3)"},null,"Available from CTM",null,null,"Imported date:"]
[{"$f":"HYPERLINK(\"#'Monthly Collection Waste'!A1\",\"Waste Data (WR1, WR2)\")","v":"Waste Data (WR1, WR2)"},null,"Available from SSP/JLL",null,{"$f":"IF(C26=\"NA\",\"\",IFERROR(IF(\nCOUNTBLANK(INDIRECT(\"'Monthly Collection Waste'!\"&LEFT(ADDRESS(1,MATCH(\"Waste Stream\",INDIRECT(\"'Monthly Collection Waste'!1:1\"),0),2),SEARCH(\"$\",ADDRESS(1,MATCH(\"Waste Stream\",INDIRECT(\"'Monthly Collection Waste'!1:1\"),0),2))-1)&\"1:\"&LEFT(ADDRESS(1,MATCH(\"Waste Stream\",INDIRECT(\"'Monthly Collection Waste'!1:1\"),0),2),SEARCH(\"$\",ADDRESS(1,MATCH(\"Waste Stream\",INDIRECT(\"'Monthly Collection Waste'!1:1\"),0),2))-1)&COUNTA(INDIRECT(\"'Monthly Collection Waste'!A:A\"))))\n\n+\n\nCOUNTBLANK(INDIRECT(\"'Monthly Collection Waste'!\"&LEFT(ADDRESS(1,MATCH(\"Disposal Stream\",INDIRECT(\"'Monthly Collection Waste'!1:1\"),0),2),SEARCH(\"$\",ADDRESS(1,MATCH(\"Disposal Stream\",INDIRECT(\"'Monthly Collection Waste'!1:1\"),0),2))-1)&\"1:\"&LEFT(ADDRESS(1,MATCH(\"Disposal Stream\",INDIRECT(\"'Monthly Collection Waste'!1:1\"),0),2),SEARCH(\"$\",ADDRESS(1,MATCH(\"Disposal Stream\",INDIRECT(\"'Monthly Collection Waste'!1:1\"),0),2))-1)&COUNTA(INDIRECT(\"'Monthly Collection Waste'!A:A\"))))\n\n= 0, IF(COUNTA(INDIRECT(\"'Monthly Collection Waste'!A:A\"))=1,\"Not Imported\", \"Complete\"), \"In Progress\"\n),\"Not Imported\"))","v":""},"Imported date:"]
[]
["3. Input data","Link","Status"]
["Electricity Use","Input data",{"$f":"'Electricity Use'!H8","v":"NA"},"View report"]
["Stationary Fuel Use","Input data",{"$f":"'Stationary Fuel Use'!H8","v":"NA"},"View report"]
["Transportation","Input data",{"$f":"Transportation!H8","v":"NA"},"View report"]
["Total Energy Use","Input data",{"$f":"'Total Energy Use'!H8","v":"NA"},"View report"]
["Sustainable Buildings and Infrastructure","Input data",{"$f":"'Sust.Buildings & Infrastructure'!H8","v":"NA"}]
["Water Use","Input data",{"$f":"'Water Use'!H8","v":"NA"},"View report"]
["Waste and Recycling","Input data",{"$f":"'Waste and Recycling'!H8","v":"NA"},"View report"]
["Greenhouse gas emissions","Input data",{"$f":"'Greenhouse Gas Emissions'!H8","v":"NA"},"View report"]
[]
["4. Finalise report"]
[]
[null,"Disclaimer: This tool has been developed for use by Victorian Government agencies for the purpose of complying with Financial Reporting Direction 24: Reporting of environmental data by government entities. It is not intended for use for other purposes. "]

{"sheet":"Report - Electricity","index":1,"n_rows":60,"n_cols":14,"rows_kept":60,"cut":false,"hidden":true,"merged":[[5,1,5,6],[59,3,59,5]]}
[]
[]
[]
[]
[]
[null,{"$f":"Agency&\" | \"&Tier&\" | \"&ReportingPeriod","v":" |  |  - "}]
[]
[null,"<- Back to Home",null,null,null,null,null,null,null,null,null,null,null," "]
[]
[null,"Electricity Use"]
[]
[null,null,"Indicator",null,null,null,{"$f":"ReportingYear","v":0},"Final value column","Lookup - indicator","Indicator column","Lookup - segment","Segment column","Lookup - sheet"]
[null,null,"EL1. Total electricity consumption segmented by source (MWh)",null,null,null,{"$f":"SUMIFS(INDIRECT(\"'\"&M13&\"'!\"&H13&\":\"&H13),INDIRECT(\"'\"&M13&\"'!\"&J13&\":\"&J13),I13,INDIRECT(\"'\"&M13&\"'!\"&L13&\":\"&L13),K13)","v":0},"J","EL1","B","*","D","Electricity Use"]
[null,null,null,"Purchased electricity (MWh)",null,null,{"$f":"SUMIFS(INDIRECT(\"'\"&M14&\"'!\"&H14&\":\"&H14),INDIRECT(\"'\"&M14&\"'!\"&J14&\":\"&J14),I14,INDIRECT(\"'\"&M14&\"'!\"&L14&\":\"&L14),K14)","v":0},"J","EL1.1","B","*","D","Electricity Use"]
[null,null,null,"Not directly purchased but from outside the organisation (MWh)",null,null,0,"J","EL1.2","B","*","D","Electricity Use"]
[null,null,null,"Self-generated (MWh)",null,null,0,"J","EL1.3","B","*","D","Electricity Use"]
[]
[null,null,"EL2. On-site electricity generated segmented by usage and source (MWh)  ",null,null,null,0,"J","EL2","B","*","D","Electricity Use"]
[null,null,null,"Consumption behind-the-meter",null,null,{"$f":"SUMIFS(INDIRECT(\"'\"&M19&\"'!\"&H19&\":\"&H19),INDIRECT(\"'\"&M19&\"'!\"&J19&\":\"&J19),I19,INDIRECT(\"'\"&M19&\"'!\"&L19&\":\"&L19),K19)","v":0},"J","EL2.1","B","*","D","Electricity Use"]
[null,null,null,null,"Wind",null,0,"J","EL2.1.1","B","*","D","Electricity Use"]
[null,null,null,null,"Solar PV ",null,0,"J","EL2.1.2","B","*","D","Electricity Use"]
[null,null,null,null,"Bioenergy (incl. biogas from wastewater or landfill)",null,0,"J","EL2.1.3","B","*","D","Electricity Use"]
[null,null,null,null,"Hydroelectric",null,0,"J","EL2.1.4","B","*","D","Electricity Use"]
[null,null,null,null,"Other renewable",null,0,"J","EL2.1.5","B","*","D","Electricity Use"]
[null,null,null,null,"Cogeneration",null,0,"J","EL2.1.6","B","*","D","Electricity Use"]
[null,null,null,null,"Other non-renewable",null,0,"J","EL2.1.7","B","*","D","Electricity Use"]
[null,null,null,"Exports",null,null,0,"J","EL2.2","B","*","D","Electricity Use"]
[null,null,null,null,"Wind",null,{"$f":"SUMIFS(INDIRECT(\"'\"&M28&\"'!\"&H28&\":\"&H28),INDIRECT(\"'\"&M28&\"'!\"&J28&\":\"&J28),I28,INDIRECT(\"'\"&M28&\"'!\"&L28&\":\"&L28),K28)","v":0},"J","EL2.2.1","B","*","D","Electricity Use"]
[null,null,null,null,"Solar PV ",null,0,"J","EL2.2.2","B","*","D","Electricity Use"]
[null,null,null,null,"Bioenergy (incl. biogas from wastewater or landfill)",null,0,"J","EL2.2.3","B","*","D","Electricity Use"]
[null,null,null,null,"Hydroelectric",null,0,"J","EL2.2.4","B","*","D","Electricity Use"]
[null,null,null,null,"Other renewable",null,0,"J","EL2.2.5","B","*","D","Electricity Use"]
[null,null,null,null,"Cogeneration",null,0,"J","EL2.2.6","B","*","D","Electricity Use"]
[null,null,null,null,"Other non-renewable",null,0,"J","EL2.2.7","B","*","D","Electricity Use"]
[null,null,null,"For use outside the facility other than for supply to the grid",null,null,0,"J","EL2.3","B","*","D","Electricity Use"]
[null,null,null,null,"Wind",null,{"$f":"SUMIFS(INDIRECT(\"'\"&M36&\"'!\"&H36&\":\"&H36),INDIRECT(\"'\"&M36&\"'!\"&J36&\":\"&J36),I36,INDIRECT(\"'\"&M36&\"'!\"&L36&\":\"&L36),K36)","v":0},"J","EL2.3.1","B","*","D","Electricity Use"]
[null,null,null,null,"Solar PV ",null,0,"J","EL2.3.2","B","*","D","Electricity Use"]
[null,null,null,null,"Bioenergy (incl. biogas from wastewater or landfill)",null,0,"J","EL2.3.3","B","*","D","Electricity Use"]
[null,null,null,null,"Hydroelectric",null,0,"J","EL2.3.4","B","*","D","Electricity Use"]
[null,null,null,null,"Other renewable",null,0,"J","EL2.3.5","B","*","D","Electricity Use"]
[null,null,null,null,"Cogeneration",null,0,"J","EL2.3.6","B","*","D","Electricity Use"]
[null,null,null,null,"Other non-renewable",null,0,"J","EL2.3.7","B","*","D","Electricity Use"]
[]
[null,null,"EL3. On-site installed generation capacity segmented by source (MW) ",null,null,null,0,"J","EL3","B","*","D","Electricity Use"]
[null,null,null,"Wind",null,null,0,"J","EL3.1","B","*","D","Electricity Use"]
[null,null,null,"Solar PV ",null,null,0,"J","EL3.2","B","*","D","Electricity Use"]
[null,null,null,"Bioenergy (incl. biogas from wastewater or landfill)",null,null,0,"J","EL3.3","B","*","D","Electricity Use"]
[null,null,null,"Hydroelectric",null,null,0,"J","EL3.4","B","*","D","Electricity Use"]
[null,null,null,"Other renewable",null,null,0,"J","EL3.5","B","*","D","Electricity Use"]
[null,null,null,"Energy storage systems (power capacity)",null,null,{"$f":"SUMIFS(INDIRECT(\"'\"&M50&\"'!\"&H50&\":\"&H50),INDIRECT(\"'\"&M50&\"'!\"&J50&\":\"&J50),I50,INDIRECT(\"'\"&M50&\"'!\"&L50&\":\"&L50),K50)","v":0},"J","EL3.6","B","*","D","Electricity Use"]
[null,null,null,"Energy storage systems (total storage capacity) (MWh)",null,null,0,"J","EL3.7","B","*","D","Electricity Use"]
[null,null,null,"Cogeneration",null,null,0,"J","EL3.8","B","*","D","Electricity Use"]
[null,null,null,"Other non-renewable",null,null,0,"J","EL3.9","B","*","D","Electricity Use"]
[null,null,null,null,null,null,null,null,null,null,null,"D"]
[null,null,"EL4. Total electricity offsets segmented by offset type (MWh) ",null,null,null,0,"J","EL4","B","*","D","Electricity Use"]
[null,null,null,"LGC’s voluntarily retired by the Entity",null,null,0,"J","EL4.1","B","*","D","Electricity Use"]
[null,null,null,"LGC’s voluntarily retired by the Entity’s behalf",null,null,0,"J","EL4.2","B","*","D","Electricity Use"]
[null,null,null,"Greenpower",null,null,0,"J","EL4.3.1","B","*","D","Electricity Use"]
[null,null,null,"Certified carbon neutral electricity purchased",null,null,0,"J","EL4.3.2","B","*","D","Electricity Use"]
[null,null,null,"LCG's mandatorily retired or LCG's conveyed to an entity's retailer for mandatory retirement",null,null,{"$f":"SUMIFS(INDIRECT(\"'\"&M60&\"'!\"&H60&\":\"&H60),INDIRECT(\"'\"&M60&\"'!\"&J60&\":\"&J60),I60,INDIRECT(\"'\"&M60&\"'!\"&L60&\":\"&L60),K60)","v":0},"J","EL4.4","B","*","D","Electricity Use"]

{"sheet":"Report - Stationary Fuel Use","index":2,"n_rows":38,"n_cols":14,"rows_kept":38,"cut":false,"hidden":true,"merged":[[30,2,30,5],[5,1,5,6]]}
[]
[]
[]
[]
[]
[null,{"$f":"Agency&\" | \"&Tier&\" | \"&ReportingPeriod","v":" |  |  - "}]
[]
[null,"<- Back to Home",null,null,null,null,null,null,null,null,null,null,null," "]
[]
[null,"Stationary Fuel Use"]
[]
[null,null,"Indicator",null,null,null,{"$f":"ReportingYear","v":0},"Final value column","Lookup - indicator","Indicator column","Lookup - segment","Segment column","Lookup - sheet"]
[null,null,"F1. Total Fuels used in buildings and machinery (MJ)",null,null,null,{"$f":"SUMIFS(INDIRECT(\"'\"&M13&\"'!\"&H13&\":\"&H13),INDIRECT(\"'\"&M13&\"'!\"&J13&\":\"&J13),I13,INDIRECT(\"'\"&M13&\"'!\"&L13&\":\"&L13),K13)","v":0},"J","F1","B","*","D","Stationary Fuel Use"]
[null,null,null,"Buildings",null,null,{"$f":"SUMIFS(INDIRECT(\"'\"&M14&\"'!\"&H14&\":\"&H14),INDIRECT(\"'\"&M14&\"'!\"&J14&\":\"&J14),I14,INDIRECT(\"'\"&M14&\"'!\"&L14&\":\"&L14),K14)","v":0},"J","F1.1","B","*","D","Stationary Fuel Use"]
[null,null,null,null,"Natural gas",null,0,"J","F1.1.1","B","*","D","Stationary Fuel Use"]
[null,null,null,null,"LPG",null,0,"J","F1.1.2","B","*","D","Stationary Fuel Use"]
[null,null,null,null,"Diesel",null,0,"J","F1.1.3","B","*","D","Stationary Fuel Use"]
[null,null,null,null,"Petrol",null,0,"J","F1.1.4","B","*","D","Stationary Fuel Use"]
[null,null,null,null,"Hydrogen",null,0,"J","F1.1.5","B","*","D","Stationary Fuel Use"]
[null,null,null,null,"Fuel oil",null,0,"J","F1.1.6","B","*","D","Stationary Fuel Use"]
[null,null,null,null,"Solid fuel",null,0,"J","F1.1.7","B","*","D","Stationary Fuel Use"]
[null,null,null,"Machinery",null,null,0,"J","F1.2","B","*","D","Stationary Fuel Use"]
[null,null,null,null,"Natural gas",null,0,"J","F1.2.1","B","*","D","Stationary Fuel Use"]
[null,null,null,null,"LPG",null,0,"J","F1.2.2","B","*","D","Stationary Fuel Use"]
[null,null,null,null,"Diesel",null,0,"J","F1.2.3","B","*","D","Stationary Fuel Use"]
[null,null,null,null,"Petrol",null,0,"J","F1.2.4","B","*","D","Stationary Fuel Use"]
[null,null,null,null,"Hydrogen",null,0,"J","F1.2.5","B","*","D","Stationary Fuel Use"]
[null,null,null,null,"Fuel oil",null,0,"J","F1.2.6","B","*","D","Stationary Fuel Use"]
[null,null,null,null,"Solid fuel",null,0,"J","F1.2.7","B","*","D","Stationary Fuel Use"]
[null,null,null,null,null,null,null,null,null,null,null,"D"]
[null,null,"F2. Greenhouse gas emissions from stationary fuel consumption segmented by fuel type (Tonnes CO2-e)",null,null,null,0,"J","F2","B","*","D","Stationary Fuel Use"]
[null,null,null,null,"Natural gas",null,0,"J","F2.1","B","*","D","Stationary Fuel Use"]
[null,null,null,null,"LPG",null,0,"J","F2.2","B","*","D","Stationary Fuel Use"]
[null,null,null,null,"Diesel",null,0,"J","F2.3","B","*","D","Stationary Fuel Use"]
[null,null,null,null,"Petrol",null,0,"J","F2.4","B","*","D","Stationary Fuel Use"]
[null,null,null,null,"Hydrogen",null,0,"J","F2.5","B","*","D","Stationary Fuel Use"]
[null,null,null,null,"Fuel oil",null,0,"J","F2.6","B","*","D","Stationary Fuel Use"]
[null,null,null,null,"Solid fuel",null,0,"J","F2.7","B","*","D","Stationary Fuel Use"]

{"sheet":"Report - Transportation","index":3,"n_rows":178,"n_cols":15,"rows_kept":178,"cut":false,"hidden":true,"merged":[[5,1,5,7],[12,2,12,6],[31,2,31,6],[158,2,158,6],[177,2,177,6]]}
[]
[]
[]
[]
[]
[null,{"$f":"Agency&\" | \"&Tier&\" | \"&ReportingPeriod","v":" |  |  - "}]
[]
[null,"<- Back to Home"]
[]
[null,"Transportation"]
[]
[null,null,"Indicator",null,null,null,null,{"$f":"ReportingYear","v":0},"%","Final value column","Lookup - indicator","Indicator column","Lookup - segment","Segment column","Lookup - sheet"]
[null,null,"T1. Total energy used in transportation within the Entity segmented by fuel type and vehicle category (MWh)",null,null,null,null,{"$f":"SUMIFS(INDIRECT(\"'\"&O13&\"'!\"&J13&\":\"&J13),INDIRECT(\"'\"&O13&\"'!\"&L13&\":\"&L13),K13,INDIRECT(\"'\"&O13&\"'!\"&N13&\":\"&N13),M13)","v":0},null,"J","T1","B","*","D","Transportation"]
[null,null,null,"Road vehicles",null,null,null,0,null,"J","T1*","B","*frdsegmentsplitroad vehicles","D","Transportation"]
[null,null,null,null,"Petrol",null,null,0,null,"J","T1.1*","B","*frdsegmentsplitroad vehicles","D","Transportation"]
[null,null,null,null,"Diesel",null,null,0,null,"J","T1.2*","B","*frdsegmentsplitroad vehicles","D","Transportation"]
[null,null,null,null,"Biodiesel",null,null,0,null,"J","T1.3*","B","*frdsegmentsplitroad vehicles","D","Transportation"]
[null,null,null,null,"LPG",null,null,0,null,"J","T1.4*","B","*frdsegmentsplitroad vehicles","D","Transportation"]
[null,null,null,null,"Solid fuel",null,null,0,null,"J","T1.6*","B","*frdsegmentsplitroad vehicles","D","Transportation"]
[null,null,null,null,"Hydrogen",null,null,0,null,"J","T1.7*","B","*frdsegmentsplitroad vehicles","D","Transportation"]
[null,null,null,null,"Electricity",null,null,0,null,"J","T1.8*","B","*frdsegmentsplitroad vehicles","D","Transportation"]
[null,null,null,"Non-road vehicles",null,null,null,0,null,"J","T1*","B","*frdsegmentsplitnon-road vehicles","D","Transportation"]
[null,null,null,null,"Petrol",null,null,0,null,"J","T1.1*","B","*frdsegmentsplitnon-road vehicles","D","Transportation"]
[null,null,null,null,"Diesel",null,null,0,null,"J","T1.2*","B","*frdsegmentsplitnon-road vehicles","D","Transportation"]
[null,null,null,null,"Biodiesel",null,null,0,null,"J","T1.3*","B","*frdsegmentsplitnon-road vehicles","D","Transportation"]
[null,null,null,null,"LPG",null,null,0,null,"J","T1.4*","B","*frdsegmentsplitnon-road vehicles","D","Transportation"]
[null,null,null,null,"Aviation fuels",null,null,0,null,"J","T1.5*","B","*frdsegmentsplitnon-road vehicles","D","Transportation"]
[null,null,null,null,"Solid fuel",null,null,0,null,"J","T1.6*","B","*frdsegmentsplitnon-road vehicles","D","Transportation"]
[null,null,null,null,"Hydrogen",null,null,0,null,"J","T1.7*","B","*frdsegmentsplitnon-road vehicles","D","Transportation"]
[null,null,null,null,"Electricity",null,null,0,null,"J","T1.8*","B","*frdsegmentsplitnon-road vehicles","D","Transportation"]
[]
[null,null,"T2. Number and proportion of vehicles in the organisational boundary segmented by vehicle category and engine/ fuel type (Number and %)",null,null,null,null,{"$f":"SUMIFS(INDIRECT(\"'\"&O32&\"'!\"&J32&\":\"&J32),INDIRECT(\"'\"&O32&\"'!\"&L32&\":\"&L32),K32,INDIRECT(\"'\"&O32&\"'!\"&N32&\":\"&N32),M32)","v":0},{"$f":"IF($H$32=0,0,H32/$H$32)","v":0},"J","T2","B","*","D","Transportation"]
[null,null,null,"Road vehicles",null,null,null,0,{"$f":"IF($H$32=0,0,H33/$H$32)","v":0},"J","T2*","B","*frdsegmentsplitroad vehicles","D","Transportation"]
[null,null,null,null,"Two-wheeled and three-wheeled vehicles",null,null,0,0,"J","T2*","B","*frdsegmentsplitroad vehiclesfrdsegmentsplitTwo-wheeled and three-wheeled vehicles","D","Transportation"]
[null,null,null,null,null,"Internal combustion engines",null,0,0,"J","T2.1*","B","*frdsegmentsplitroad vehiclesfrdsegmentsplitTwo-wheeled and three-wheeled vehicles","D","Transportation"]
[null,null,null,null,null,null,"Petrol",0,0,"J","T2.1.1*","B","*frdsegmentsplitroad vehiclesfrdsegmentsplitTwo-wheeled and three-wheeled vehicles","D","Transportation"]
[null,null,null,null,null,null,"Diesel/biodiesel",0,0,"J","T2.1.2*","B","*frdsegmentsplitroad vehiclesfrdsegmentsplitTwo-wheeled and three-wheeled vehicles","D","Transportation"]
[null,null,null,null,null,null,"LPG",0,0,"J","T2.1.3*","B","*frdsegmentsplitroad vehiclesfrdsegmentsplitTwo-wheeled and three-wheeled vehicles","D","Transportation"]
[null,null,null,null,null,"Hybrid",null,0,0,"J","T2.2*","B","*frdsegmentsplitroad vehiclesfrdsegmentsplitTwo-wheeled and three-wheeled vehicles","D","Transportation"]
[null,null,null,null,null,null,"Plug-in Hybrid Electric Vehicle (PHEV) ",0,0,"J","T2.2.1*","B","*frdsegmentsplitroad vehiclesfrdsegmentsplitTwo-wheeled and three-wheeled vehicles","D","Transportation"]
[null,null,null,null,null,null,"Range-extended electric vehicle ",0,0,"J","T2.2.2*","B","*frdsegmentsplitroad vehiclesfrdsegmentsplitTwo-wheeled and three-wheeled vehicles","D","Transportation"]
[null,null,null,null,null,"Electric propulsion ",null,0,0,"J","T2.3*","B","*frdsegmentsplitroad vehiclesfrdsegmentsplitTwo-wheeled and three-wheeled vehicles","D","Transportation"]
[null,null,null,null,null,null,"Battery Electric Vehicle (BEV) ",0,0,"J","T2.3.1*","B","*frdsegmentsplitroad vehiclesfrdsegmentsplitTwo-wheeled and three-wheeled vehicles","D","Transportation"]
[null,null,null,null,null,null,"Fuel Cell Electric Vehicle (FCEV)  ",0,0,"J","T2.3.2*","B","*frdsegmentsplitroad vehiclesfrdsegmentsplitTwo-wheeled and three-wheeled vehicles","D","Transportation"]
[null,null,null,null,"Passenger vehicles",null,null,0,0,"J","T2*","B","*frdsegmentsplitroad vehiclesfrdsegmentsplitPassenger vehicles","D","Transportation"]
[null,null,null,null,null,"Internal combustion engines",null,0,0,"J","T2.1*","B","*frdsegmentsplitroad vehiclesfrdsegmentsplitPassenger vehicles","D","Transportation"]
[null,null,null,null,null,null,"Petrol",0,0,"J","T2.1.1*","B","*frdsegmentsplitroad vehiclesfrdsegmentsplitPassenger vehicles","D","Transportation"]
[null,null,null,null,null,null,"Diesel/biodiesel",0,0,"J","T2.1.2*","B","*frdsegmentsplitroad vehiclesfrdsegmentsplitPassenger vehicles","D","Transportation"]
[null,null,null,null,null,null,"LPG",0,0,"J","T2.1.3*","B","*frdsegmentsplitroad vehiclesfrdsegmentsplitPassenger vehicles","D","Transportation"]
[null,null,null,null,null,"Hybrid",null,0,0,"J","T2.2*","B","*frdsegmentsplitroad vehiclesfrdsegmentsplitPassenger vehicles","D","Transportation"]
[null,null,null,null,null,null,"Plug-in Hybrid Electric Vehicle (PHEV) ",0,0,"J","T2.2.1*","B","*frdsegmentsplitroad vehiclesfrdsegmentsplitPassenger vehicles","D","Transportation"]
[null,null,null,null,null,null,"Range-extended electric vehicle ",0,0,"J","T2.2.2*","B","*frdsegmentsplitroad vehiclesfrdsegmentsplitPassenger vehicles","D","Transportation"]
[null,null,null,null,null,"Electric propulsion ",null,0,0,"J","T2.3*","B","*frdsegmentsplitroad vehiclesfrdsegmentsplitPassenger vehicles","D","Transportation"]
[null,null,null,null,null,null,"Battery Electric Vehicle (BEV) ",0,0,"J","T2.3.1*","B","*frdsegmentsplitroad vehiclesfrdsegmentsplitPassenger vehicles","D","Transportation"]
[null,null,null,null,null,null,"Fuel Cell Electric Vehicle (FCEV)  ",0,0,"J","T2.3.2*","B","*frdsegmentsplitroad vehiclesfrdsegmentsplitPassenger vehicles","D","Transportation"]
[null,null,null,null,"Buses",null,null,0,0,"J","T2*","B","*frdsegmentsplitroad vehiclesfrdsegmentsplitBuses","D","Transportation"]
[null,null,null,null,null,"Internal combustion engines",null,0,0,"J","T2.1*","B","*frdsegmentsplitroad vehiclesfrdsegmentsplitBuses","D","Transportation"]
[null,null,null,null,null,null,"Petrol",{"$f":"SUMIFS(INDIRECT(\"'\"&O58&\"'!\"&J58&\":\"&J58),INDIRECT(\"'\"&O58&\"'!\"&L58&\":\"&L58),K58,INDIRECT(\"'\"&O58&\"'!\"&N58&\":\"&N58),M58)","v":0},0,"J","T2.1.1*","B","*frdsegmentsplitroad vehiclesfrdsegmentsplitBuses","D","Transportation"]
[null,null,null,null,null,null,"Diesel/biodiesel",0,0,"J","T2.1.2*","B","*frdsegmentsplitroad vehiclesfrdsegmentsplitBuses","D","Transportation"]
[null,null,null,null,null,null,"LPG",0,0,"J","T2.1.3*","B","*frdsegmentsplitroad vehiclesfrdsegmentsplitBuses","D","Transportation"]
[null,null,null,null,null,"Hybrid",null,0,0,"J","T2.2*","B","*frdsegmentsplitroad vehiclesfrdsegmentsplitBuses","D","Transportation"]
[null,null,null,null,null,null,"Plug-in Hybrid Electric Vehicle (PHEV) ",0,0,"J","T2.2.1*","B","*frdsegmentsplitroad vehiclesfrdsegmentsplitBuses","D","Transportation"]
[null,null,null,null,null,null,"Range-extended electric vehicle ",0,0,"J","T2.2.2*","B","*frdsegmentsplitroad vehiclesfrdsegmentsplitBuses","D","Transportation"]
[null,null,null,null,null,"Electric propulsion ",null,0,0,"J","T2.3*","B","*frdsegmentsplitroad vehiclesfrdsegmentsplitBuses","D","Transportation"]
[null,null,null,null,null,null,"Battery Electric Vehicle (BEV) ",0,0,"J","T2.3.1*","B","*frdsegmentsplitroad vehiclesfrdsegmentsplitBuses","D","Transportation"]
[null,null,null,null,null,null,"Fuel Cell Electric Vehicle (FCEV)  ",0,0,"J","T2.3.2*","B","*frdsegmentsplitroad vehiclesfrdsegmentsplitBuses","D","Transportation"]
[null,null,null,null,"Goods vehicles",null,null,0,0,"J","T2*","B","*frdsegmentsplitroad vehiclesfrdsegmentsplitGoods vehicles","D","Transportation"]
[null,null,null,null,null,"Internal combustion engines",null,0,0,"J","T2.1*","B","*frdsegmentsplitroad vehiclesfrdsegmentsplitGoods vehicles","D","Transportation"]
[null,null,null,null,null,null,"Petrol",0,0,"J","T2.1.1*","B","*frdsegmentsplitroad vehiclesfrdsegmentsplitGoods vehicles","D","Transportation"]
[null,null,null,null,null,null,"Diesel/biodiesel",0,0,"J","T2.1.2*","B","*frdsegmentsplitroad vehiclesfrdsegmentsplitGoods vehicles","D","Transportation"]
[null,null,null,null,null,null,"LPG",0,0,"J","T2.1.3*","B","*frdsegmentsplitroad vehiclesfrdsegmentsplitGoods vehicles","D","Transportation"]
[null,null,null,null,null,"Hybrid",null,0,0,"J","T2.2*","B","*frdsegmentsplitroad vehiclesfrdsegmentsplitGoods vehicles","D","Transportation"]
[null,null,null,null,null,null,"Plug-in Hybrid Electric Vehicle (PHEV) ",0,0,"J","T2.2.1*","B","*frdsegmentsplitroad vehiclesfrdsegmentsplitGoods vehicles","D","Transportation"]
[null,null,null,null,null,null,"Range-extended electric vehicle ",0,0,"J","T2.2.2*","B","*frdsegmentsplitroad vehiclesfrdsegmentsplitGoods vehicles","D","Transportation"]
[null,null,null,null,null,"Electric propulsion ",null,0,0,"J","T2.3*","B","*frdsegmentsplitroad vehiclesfrdsegmentsplitGoods vehicles","D","Transportation"]
[null,null,null,null,null,null,"Battery Electric Vehicle (BEV) ",0,0,"J","T2.3.1*","B","*frdsegmentsplitroad vehiclesfrdsegmentsplitGoods vehicles","D","Transportation"]
[null,null,null,null,null,null,"Fuel Cell Electric Vehicle (FCEV)  ",0,0,"J","T2.3.2*","B","*frdsegmentsplitroad vehiclesfrdsegmentsplitGoods vehicles","D","Transportation"]
[null,null,null,"Non-road vehicles",null,null,null,0,0,"J","T2*","B","*frdsegmentsplitnon-road vehicles","D","Transportation"]
[null,null,null,null,"Heavy rail locomotives",null,null,0,0,"J","T2*","B","*frdsegmentsplitnon-road vehiclesfrdsegmentsplitHeavy rail locomotives","D","Transportation"]
[null,null,null,null,null,"Internal combustion engines",null,0,0,"J","T2.1*","B","*frdsegmentsplitnon-road vehiclesfrdsegmentsplitHeavy rail locomotives","D","Transportation"]
[null,null,null,null,null,null,"Petrol",0,0,"J","T2.1.1*","B","*frdsegmentsplitnon-road vehiclesfrdsegmentsplitHeavy rail locomotives","D","Transportation"]
[null,null,null,null,null,null,"Diesel/biodiesel",0,0,"J","T2.1.2*","B","*frdsegmentsplitnon-road vehiclesfrdsegmentsplitHeavy rail locomotives","D","Transportation"]
[null,null,null,null,null,null,"LPG",0,0,"J","T2.1.3*","B","*frdsegmentsplitnon-road vehiclesfrdsegmentsplitHeavy rail locomotives","D","Transportation"]
[null,null,null,null,null,null,"Solid fuel",{"$f":"SUMIFS(INDIRECT(\"'\"&O84&\"'!\"&J84&\":\"&J84),INDIRECT(\"'\"&O84&\"'!\"&L84&\":\"&L84),K84,INDIRECT(\"'\"&O84&\"'!\"&N84&\":\"&N84),M84)","v":0},0,"J","T2.1.5*","B","*frdsegmentsplitnon-road vehiclesfrdsegmentsplitHeavy rail locomotives","D","Transportation"]
[null,null,null,null,null,null,"Fuel oil",0,0,"J","T2.1.6*","B","*frdsegmentsplitnon-road vehiclesfrdsegmentsplitHeavy rail locomotives","D","Transportation"]
[null,null,null,null,null,"Hybrid",null,0,0,"J","T2.2*","B","*frdsegmentsplitnon-road vehiclesfrdsegmentsplitHeavy rail locomotives","D","Transportation"]
[null,null,null,null,null,null,"Plug-in Hybrid Electric Vehicle (PHEV) ",0,0,"J","T2.2.1*","B","*frdsegmentsplitnon-road vehiclesfrdsegmentsplitHeavy rail locomotives","D","Transportation"]
[null,null,null,null,null,null,"Range-extended electric vehicle ",0,0,"J","T2.2.2*","B","*frdsegmentsplitnon-road vehiclesfrdsegmentsplitHeavy rail locomotives","D","Transportation"]
[null,null,null,null,null,"Electric propulsion ",null,0,0,"J","T2.3*","B","*frdsegmentsplitnon-road vehiclesfrdsegmentsplitHeavy rail locomotives","D","Transportation"]
[null,null,null,null,null,null,"Battery Electric Vehicle (BEV) ",0,0,"J","T2.3.1*","B","*frdsegmentsplitnon-road vehiclesfrdsegmentsplitHeavy rail locomotives","D","Transportation"]
[null,null,null,null,null,null,"Fuel Cell Electric Vehicle (FCEV)  ",0,0,"J","T2.3.2*","B","*frdsegmentsplitnon-road vehiclesfrdsegmentsplitHeavy rail locomotives","D","Transportation"]
[null,null,null,null,null,null,"External powered (such as rail locomotives and trams) ",0,0,"J","T2.3.3*","B","*frdsegmentsplitnon-road vehiclesfrdsegmentsplitHeavy rail locomotives","D","Transportation"]
[null,null,null,null,"Light rail vehicles",null,null,0,0,"J","T2*","B","*frdsegmentsplitnon-road vehiclesfrdsegmentsplitLight rail vehicles","D","Transportation"]
[null,null,null,null,null,"Internal combustion engines",null,0,0,"J","T2.1*","B","*frdsegmentsplitnon-road vehiclesfrdsegmentsplitLight rail vehicles","D","Transportation"]
[null,null,null,null,null,null,"Petrol",0,0,"J","T2.1.1*","B","*frdsegmentsplitnon-road vehiclesfrdsegmentsplitLight rail vehicles","D","Transportation"]
[null,null,null,null,null,null,"Diesel/biodiesel",0,0,"J","T2.1.2*","B","*frdsegmentsplitnon-road vehiclesfrdsegmentsplitLight rail vehicles","D","Transportation"]
[null,null,null,null,null,null,"LPG",0,0,"J","T2.1.3*","B","*frdsegmentsplitnon-road vehiclesfrdsegmentsplitLight rail vehicles","D","Transportation"]
[null,null,null,null,null,null,"Solid fuel",0,0,"J","T2.1.5*","B","*frdsegmentsplitnon-road vehiclesfrdsegmentsplitLight rail vehicles","D","Transportation"]
[null,null,null,null,null,null,"Fuel oil",0,0,"J","T2.1.6*","B","*frdsegmentsplitnon-road vehiclesfrdsegmentsplitLight rail vehicles","D","Transportation"]
[null,null,null,null,null,"Hybrid",null,0,0,"J","T2.2*","B","*frdsegmentsplitnon-road vehiclesfrdsegmentsplitLight rail vehicles","D","Transportation"]
[null,null,null,null,null,null,"Plug-in Hybrid Electric Vehicle (PHEV) ",0,0,"J","T2.2.1*","B","*frdsegmentsplitnon-road vehiclesfrdsegmentsplitLight rail vehicles","D","Transportation"]
[null,null,null,null,null,null,"Range-extended electric vehicle ",0,0,"J","T2.2.2*","B","*frdsegmentsplitnon-road vehiclesfrdsegmentsplitLight rail vehicles","D","Transportation"]
[null,null,null,null,null,"Electric propulsion ",null,0,0,"J","T2.3*","B","*frdsegmentsplitnon-road vehiclesfrdsegmentsplitLight rail vehicles","D","Transportation"]
[null,null,null,null,null,null,"Battery Electric Vehicle (BEV) ",0,0,"J","T2.3.1*","B","*frdsegmentsplitnon-road vehiclesfrdsegmentsplitLight rail vehicles","D","Transportation"]
[null,null,null,null,null,null,"Fuel Cell Electric Vehicle (FCEV)  ",0,0,"J","T2.3.2*","B","*frdsegmentsplitnon-road vehiclesfrdsegmentsplitLight rail vehicles","D","Transportation"]
[null,null,null,null,null,null,"External powered (such as rail locomotives and trams) ",0,0,"J","T2.3.3*","B","*frdsegmentsplitnon-road vehiclesfrdsegmentsplitLight rail vehicles","D","Transportation"]
[null,null,null,null,"Marine vessels",null,null,0,0,"J","T2*","B","*frdsegmentsplitnon-road vehiclesfrdsegmentsplitMarine vessels","D","Transportation"]
[null,null,null,null,null,"Internal combustion engines",null,0,0,"J","T2.1*","B","*frdsegmentsplitnon-road vehiclesfrdsegmentsplitMarine vessels","D","Transportation"]
[null,null,null,null,null,null,"Petrol",0,0,"J","T2.1.1*","B","*frdsegmentsplitnon-road vehiclesfrdsegmentsplitMarine vessels","D","Transportation"]
[null,null,null,null,null,null,"Diesel/biodiesel",0,0,"J","T2.1.2*","B","*frdsegmentsplitnon-road vehiclesfrdsegmentsplitMarine vessels","D","Transportation"]
[null,null,null,null,null,null,"LPG",0,0,"J","T2.1.3*","B","*frdsegmentsplitnon-road vehiclesfrdsegmentsplitMarine vessels","D","Transportation"]
[null,null,null,null,null,null,"Solid fuel",0,0,"J","T2.1.5*","B","*frdsegmentsplitnon-road vehiclesfrdsegmentsplitMarine vessels","D","Transportation"]
[null,null,null,null,null,null,"Fuel oil",0,0,"J","T2.1.6*","B","*frdsegmentsplitnon-road vehiclesfrdsegmentsplitMarine vessels","D","Transportation"]
[null,null,null,null,null,"Hybrid",null,0,0,"J","T2.2*","B","*frdsegmentsplitnon-road vehiclesfrdsegmentsplitMarine vessels","D","Transportation"]
[null,null,null,null,null,null,"Plug-in Hybrid Electric Vehicle (PHEV) ",0,0,"J","T2.2.1*","B","*frdsegmentsplitnon-road vehiclesfrdsegmentsplitMarine vessels","D","Transportation"]
[null,null,null,null,null,null,"Range-extended electric vehicle ",{"$f":"SUMIFS(INDIRECT(\"'\"&O116&\"'!\"&J116&\":\"&J116),INDIRECT(\"'\"&O116&\"'!\"&L116&\":\"&L116),K116,INDIRECT(\"'\"&O116&\"'!\"&N116&\":\"&N116),M116)","v":0},0,"J","T2.2.2*","B","*frdsegmentsplitnon-road vehiclesfrdsegmentsplitMarine vessels","D","Transportation"]
[null,null,null,null,null,"Electric propulsion ",null,0,0,"J","T2.3*","B","*frdsegmentsplitnon-road vehiclesfrdsegmentsplitMarine vessels","D","Transportation"]
[null,null,null,null,null,null,"Battery Electric Vehicle (BEV) ",0,0,"J","T2.3.1*","B","*frdsegmentsplitnon-road vehiclesfrdsegmentsplitMarine vessels","D","Transportation"]
[null,null,null,null,null,null,"Fuel Cell Electric Vehicle (FCEV)  ",0,0,"J","T2.3.2*","B","*frdsegmentsplitnon-road vehiclesfrdsegmentsplitMarine vessels","D","Transportation"]
[null,null,null,null,"Rotary wing aircraft",null,null,0,0,"J","T2*","B","*frdsegmentsplitnon-road vehiclesfrdsegmentsplitRotary wing aircraft","D","Transportation"]
[null,null,null,null,null,"Internal combustion engines",null,0,0,"J","T2.1*","B","*frdsegmentsplitnon-road vehiclesfrdsegmentsplitRotary wing aircraft","D","Transportation"]
[null,null,null,null,null,null,"Petrol",0,0,"J","T2.1.1*","B","*frdsegmentsplitnon-road vehiclesfrdsegmentsplitRotary wing aircraft","D","Transportation"]
[null,null,null,null,null,null,"Diesel/biodiesel",0,0,"J","T2.1.2*","B","*frdsegmentsplitnon-road vehiclesfrdsegmentsplitRotary wing aircraft","D","Transportation"]
[null,null,null,null,null,null,"LPG",0,0,"J","T2.1.3*","B","*frdsegmentsplitnon-road vehiclesfrdsegmentsplitRotary wing aircraft","D","Transportation"]
[null,null,null,null,null,null,"Aviation fuels",0,0,"J","T2.1.4*","B","*frdsegmentsplitnon-road vehiclesfrdsegmentsplitRotary wing aircraft","D","Transportation"]
[null,null,null,null,null,null,"Fuel oil",0,0,"J","T2.1.6*","B","*frdsegmentsplitnon-road vehiclesfrdsegmentsplitRotary wing aircraft","D","Transportation"]
[null,null,null,null,null,"Hybrid",null,0,0,"J","T2.2*","B","*frdsegmentsplitnon-road vehiclesfrdsegmentsplitRotary wing aircraft","D","Transportation"]
[null,null,null,null,null,null,"Plug-in Hybrid Electric Vehicle (PHEV) ",0,0,"J","T2.2.1*","B","*frdsegmentsplitnon-road vehiclesfrdsegmentsplitRotary wing aircraft","D","Transportation"]
[null,null,null,null,null,null,"Range-extended electric vehicle ",0,0,"J","T2.2.2*","B","*frdsegmentsplitnon-road vehiclesfrdsegmentsplitRotary wing aircraft","D","Transportation"]
[null,null,null,null,null,"Electric propulsion ",null,0,0,"J","T2.3*","B","*frdsegmentsplitnon-road vehiclesfrdsegmentsplitRotary wing aircraft","D","Transportation"]
[null,null,null,null,null,null,"Battery Electric Vehicle (BEV) ",0,0,"J","T2.3.1*","B","*frdsegmentsplitnon-road vehiclesfrdsegmentsplitRotary wing aircraft","D","Transportation"]
[null,null,null,null,null,null,"Fuel Cell Electric Vehicle (FCEV)  ",0,0,"J","T2.3.2*","B","*frdsegmentsplitnon-road vehiclesfrdsegmentsplitRotary wing aircraft","D","Transportation"]
[null,null,null,null,"Fixed wing aircraft",null,null,0,0,"J","T2*","B","*frdsegmentsplitnon-road vehiclesfrdsegmentsplitFixed wing aircraft","D","Transportation"]
[null,null,null,null,null,"Internal combustion engines",null,0,0,"J","T2.1*","B","*frdsegmentsplitnon-road vehiclesfrdsegmentsplitFixed wing aircraft","D","Transportation"]
[null,null,null,null,null,null,"Petrol",0,0,"J","T2.1.1*","B","*frdsegmentsplitnon-road vehiclesfrdsegmentsplitFixed wing aircraft","D","Transportation"]
[null,null,null,null,null,null,"Diesel/biodiesel",0,0,"J","T2.1.2*","B","*frdsegmentsplitnon-road vehiclesfrdsegmentsplitFixed wing aircraft","D","Transportation"]
[null,null,null,null,null,null,"LPG",0,0,"J","T2.1.3*","B","*frdsegmentsplitnon-road vehiclesfrdsegmentsplitFixed wing aircraft","D","Transportation"]
[null,null,null,null,null,null,"Aviation fuels",0,0,"J","T2.1.4*","B","*frdsegmentsplitnon-road vehiclesfrdsegmentsplitFixed wing aircraft","D","Transportation"]
[null,null,null,null,null,null,"Fuel oil",0,0,"J","T2.1.6*","B","*frdsegmentsplitnon-road vehiclesfrdsegmentsplitFixed wing aircraft","D","Transportation"]
[null,null,null,null,null,"Hybrid",null,0,0,"J","T2.2*","B","*frdsegmentsplitnon-road vehiclesfrdsegmentsplitFixed wing aircraft","D","Transportation"]
[null,null,null,null,null,null,"Plug-in Hybrid Electric Vehicle (PHEV) ",0,0,"J","T2.2.1*","B","*frdsegmentsplitnon-road vehiclesfrdsegmentsplitFixed wing aircraft","D","Transportation"]
[null,null,null,null,null,null,"Range-extended electric vehicle ",0,0,"J","T2.2.2*","B","*frdsegmentsplitnon-road vehiclesfrdsegmentsplitFixed wing aircraft","D","Transportation"]
[null,null,null,null,null,"Electric propulsion ",null,0,0,"J","T2.3*","B","*frdsegmentsplitnon-road vehiclesfrdsegmentsplitFixed wing aircraft","D","Transportation"]
[null,null,null,null,null,null,"Battery Electric Vehicle (BEV) ",{"$f":"SUMIFS(INDIRECT(\"'\"&O144&\"'!\"&J144&\":\"&J144),INDIRECT(\"'\"&O144&\"'!\"&L144&\":\"&L144),K144,INDIRECT(\"'\"&O144&\"'!\"&N144&\":\"&N144),M144)","v":0},0,"J","T2.3.1*","B","*frdsegmentsplitnon-road vehiclesfrdsegmentsplitFixed wing aircraft","D","Transportation"]
[null,null,null,null,null,null,"Fuel Cell Electric Vehicle (FCEV)  ",0,0,"J","T2.3.2*","B","*frdsegmentsplitnon-road vehiclesfrdsegmentsplitFixed wing aircraft","D","Transportation"]
[null,null,null,null,"Other non-road vehicles",null,null,0,0,"J","T2*","B","*frdsegmentsplitnon-road vehiclesfrdsegmentsplitOther non-road vehicles","D","Transportation"]
[null,null,null,null,null,"Internal combustion engines",null,0,0,"J","T2.1*","B","*frdsegmentsplitnon-road vehiclesfrdsegmentsplitOther non-road vehicles","D","Transportation"]
[null,null,null,null,null,null,"Petrol",0,0,"J","T2.1.1*","B","*frdsegmentsplitnon-road vehiclesfrdsegmentsplitOther non-road vehicles","D","Transportation"]
[null,null,null,null,null,null,"Diesel/biodiesel",0,0,"J","T2.1.2*","B","*frdsegmentsplitnon-road vehiclesfrdsegmentsplitOther non-road vehicles","D","Transportation"]
[null,null,null,null,null,null,"LPG",0,0,"J","T2.1.3*","B","*frdsegmentsplitnon-road vehiclesfrdsegmentsplitOther non-road vehicles","D","Transportation"]
[null,null,null,null,null,null,"Fuel oil",0,0,"J","T2.1.6*","B","*frdsegmentsplitnon-road vehiclesfrdsegmentsplitOther non-road vehicles","D","Transportation"]
[null,null,null,null,null,"Hybrid",null,0,0,"J","T2.2*","B","*frdsegmentsplitnon-road vehiclesfrdsegmentsplitOther non-road vehicles","D","Transportation"]
[null,null,null,null,null,null,"Plug-in Hybrid Electric Vehicle (PHEV) ",0,0,"J","T2.2.1*","B","*frdsegmentsplitnon-road vehiclesfrdsegmentsplitOther non-road vehicles","D","Transportation"]
[null,null,null,null,null,null,"Range-extended electric vehicle ",0,0,"J","T2.2.2*","B","*frdsegmentsplitnon-road vehiclesfrdsegmentsplitOther non-road vehicles","D","Transportation"]
[null,null,null,null,null,"Electric propulsion ",null,0,0,"J","T2.3*","B","*frdsegmentsplitnon-road vehiclesfrdsegmentsplitOther non-road vehicles","D","Transportation"]
[null,null,null,null,null,null,"Battery Electric Vehicle (BEV) ",0,0,"J","T2.3.1*","B","*frdsegmentsplitnon-road vehiclesfrdsegmentsplitOther non-road vehicles","D","Transportation"]
[null,null,null,null,null,null,"Fuel Cell Electric Vehicle (FCEV)  ",0,0,"J","T2.3.2*","B","*frdsegmentsplitnon-road vehiclesfrdsegmentsplitOther non-road vehicles","D","Transportation"]
[]
[null,null,"T3. Greenhouse gas emissions from vehicle fleet segmented by fuel type and vehicle category (Tonnes CO2-e)",null,null,null,null,{"$f":"SUMIFS(INDIRECT(\"'\"&O159&\"'!\"&J159&\":\"&J159),INDIRECT(\"'\"&O159&\"'!\"&L159&\":\"&L159),K159,INDIRECT(\"'\"&O159&\"'!\"&N159&\":\"&N159),M159)","v":0},null,"J","T3","B","*","D","Transportation"]
[null,null,null,"Road vehicles",null,null,null,0,null,"J","T3*","B","*frdsegmentsplitroad vehicles","D","Transportation"]
[null,null,null,null,"Petrol",null,null,0,null,"J","T3.1*","B","*frdsegmentsplitroad vehicles","D","Transportation"]
[null,null,null,null,"Diesel",null,null,0,null,"J","T3.2*","B","*frdsegmentsplitroad vehicles","D","Transportation"]
[null,null,null,null,"Biodiesel",null,null,0,null,"J","T3.3*","B","*frdsegmentsplitroad vehicles","D","Transportation"]
[null,null,null,null,"LPG",null,null,0,null,"J","T3.4*","B","*frdsegmentsplitroad vehicles","D","Transportation"]
[null,null,null,null,"Solid fuel",null,null,0,null,"J","T3.6*","B","*frdsegmentsplitroad vehicles","D","Transportation"]
[null,null,null,null,"Hydrogen",null,null,0,null,"J","T3.7*","B","*frdsegmentsplitroad vehicles","D","Transportation"]
[null,null,null,null,"Electricity",null,null,0,null,"J","T3.8*","B","*frdsegmentsplitroad vehicles","D","Transportation"]
[null,null,null,"Non-road vehicles",null,null,null,0,null,"J","T3*","B","*frdsegmentsplitnon-road vehicles","D","Transportation"]
[null,null,null,null,"Petrol",null,null,0,null,"J","T3.1*","B","*frdsegmentsplitnon-road vehicles","D","Transportation"]
[null,null,null,null,"Diesel",null,null,0,null,"J","T3.2*","B","*frdsegmentsplitnon-road vehicles","D","Transportation"]
[null,null,null,null,"Biodiesel",null,null,0,null,"J","T3.3*","B","*frdsegmentsplitnon-road vehicles","D","Transportation"]
[null,null,null,null,"LPG",null,null,0,null,"J","T3.4*","B","*frdsegmentsplitnon-road vehicles","D","Transportation"]
[null,null,null,null,"Aviation fuels",null,null,0,null,"J","T3.5*","B","*frdsegmentsplitnon-road vehicles","D","Transportation"]
[null,null,null,null,"Solid fuel",null,null,0,null,"J","T3.6*","B","*frdsegmentsplitnon-road vehicles","D","Transportation"]
[null,null,null,null,"Hydrogen",null,null,0,null,"J","T3.7*","B","*frdsegmentsplitnon-road vehicles","D","Transportation"]
[null,null,null,null,"Electricity",null,null,0,null,"J","T3.8*","B","*frdsegmentsplitnon-road vehicles","D","Transportation"]
[]
[null,null,"T4. Total distance travelled by commercial air travel (Passenger km)",null,null,null,null,{"$f":"SUMIFS(INDIRECT(\"'\"&O178&\"'!\"&J178&\":\"&J178),INDIRECT(\"'\"&O178&\"'!\"&L178&\":\"&L178),K178,INDIRECT(\"'\"&O178&\"'!\"&N178&\":\"&N178),M178)","v":0},null,"J","T4.1","B","*","D","Transportation"]

{"sheet":"Report - Total Energy Use","index":4,"n_rows":21,"n_cols":14,"rows_kept":21,"cut":false,"hidden":true,"merged":[[5,1,5,6]]}
[]
[]
[]
[]
[]
[null,{"$f":"Agency&\" | \"&Tier&\" | \"&ReportingPeriod","v":" |  |  - "}]
[]
[null,"<- Back to Home",null,null,null,null,null,null,null,null,null,null,null," "]
[]
[null,"Total Energy Use"]
[]
[null,null,"Indicator",null,null,null,{"$f":"ReportingYear","v":0},"Final value column","Lookup - indicator","Indicator column","Lookup - segment","Segment column","Lookup - sheet"]
[null,null,"E1. Total energy usage from fuels (MJ)",null,null,null,{"$f":"SUMIFS(INDIRECT(\"'\"&M13&\"'!\"&H13&\":\"&H13),INDIRECT(\"'\"&M13&\"'!\"&J13&\":\"&J13),I13,INDIRECT(\"'\"&M13&\"'!\"&L13&\":\"&L13),K13)","v":0},"J","E1","B","*","D","Total Energy Use"]
[]
[null,null,"E2. Total energy used from electricity (MJ)",null,null,null,{"$f":"SUMIFS(INDIRECT(\"'\"&M15&\"'!\"&H15&\":\"&H15),INDIRECT(\"'\"&M15&\"'!\"&J15&\":\"&J15),I15,INDIRECT(\"'\"&M15&\"'!\"&L15&\":\"&L15),K15)","v":0},"J","E2","B","*","D","Total Energy Use"]
[]
[null,null,"E3. Total energy used segmented into renewable and non-renewable sources (MJ)",null,null,null,{"$f":"SUMIFS(INDIRECT(\"'\"&M17&\"'!\"&H17&\":\"&H17),INDIRECT(\"'\"&M17&\"'!\"&J17&\":\"&J17),I17,INDIRECT(\"'\"&M17&\"'!\"&L17&\":\"&L17),K17)","v":0},"J","E3","B","*","D","Total Energy Use"]
[null,null,null,"Renewable",null,null,{"$f":"SUMIFS(INDIRECT(\"'\"&M18&\"'!\"&H18&\":\"&H18),INDIRECT(\"'\"&M18&\"'!\"&J18&\":\"&J18),I18,INDIRECT(\"'\"&M18&\"'!\"&L18&\":\"&L18),K18)","v":0},"J","E3.1","B","*","D","Total Energy Use"]
[null,null,null,"Non-renewable",null,null,{"$f":"SUMIFS(INDIRECT(\"'\"&M19&\"'!\"&H19&\":\"&H19),INDIRECT(\"'\"&M19&\"'!\"&J19&\":\"&J19),I19,INDIRECT(\"'\"&M19&\"'!\"&L19&\":\"&L19),K19)","v":0},"J","E3.2","B","*","D","Total Energy Use"]
[]
[null,null,{"$f":"\"E4. Units of energy used normalised by \"& energy.normalisation","v":"E4. Units of energy used normalised by "},null,null,null,{"$f":"SUMIFS(INDIRECT(\"'\"&M21&\"'!\"&H21&\":\"&H21),INDIRECT(\"'\"&M21&\"'!\"&J21&\":\"&J21),I21,INDIRECT(\"'\"&M21&\"'!\"&L21&\":\"&L21),K21)","v":0},"J","E4","B","*","D","Total Energy Use"]

{"sheet":"Report - Water Use","index":5,"n_rows":19,"n_cols":14,"rows_kept":19,"cut":false,"hidden":true,"merged":[[5,1,5,6]]}
[]
[]
[]
[]
[]
[null,{"$f":"Agency&\" | \"&Tier&\" | \"&ReportingPeriod","v":" |  |  - "}]
[]
[null,"<- Back to Home",null,null,null,null,null,null,null,null,null,null,null," "]
[]
[null,"Water Use"]
[]
[null,null,"Indicator",null,null,null,{"$f":"ReportingYear","v":0},"Final value column","Lookup - indicator","Indicator column","Lookup - segment","Segment column","Lookup - sheet"]
[null,null,"W1. Total water consumption by an Entity (kilolitres)",null,null,null,{"$f":"SUMIFS(INDIRECT(\"'\"&M13&\"'!\"&H13&\":\"&H13),INDIRECT(\"'\"&M13&\"'!\"&J13&\":\"&J13),I13,INDIRECT(\"'\"&M13&\"'!\"&L13&\":\"&L13),K13)","v":0},"J","W1","B","*","D","Water Use"]
[null,null,null,"Potable water consumption (from town water supply)",null,null,{"$f":"SUMIFS(INDIRECT(\"'\"&M14&\"'!\"&H14&\":\"&H14),INDIRECT(\"'\"&M14&\"'!\"&J14&\":\"&J14),I14,INDIRECT(\"'\"&M14&\"'!\"&L14&\":\"&L14),K14)","v":0},"J","W1.1","B","*","D","Water Use"]
[null,null,null,"Metered rainwater collection consumption (where available)",null,null,0,"J","W1.2","B","*","D","Water Use"]
[null,null,null,"Metered alternate supply consumption (e.g., river, stream, aquifer, bore, fire supply, third pipe etc.)",null,null,0,"J","W1.3","B","*","D","Water Use"]
[null,null,null,"Metered reused water consumption (e.g., grey or black water)",null,null,0,"J","W1.4","B","*","D","Water Use"]
[]
[null,null,{"$f":"\"W2. Units of metered water consumed normalised by \"& water.normalisation","v":"W2. Units of metered water consumed normalised by "},null,null,null,0,"J","W2","B","*","D","Water Use"]

{"sheet":"Report - Waste and Recycling","index":6,"n_rows":26,"n_cols":20,"rows_kept":26,"cut":false,"hidden":true,"merged":[[22,9,23,12],[15,9,18,19],[13,6,14,6],[5,1,5,5]]}
[]
[]
[]
[]
[]
[null,{"$f":"Agency&\" | \"&Tier&\" | \"&ReportingPeriod","v":" |  |  - "}]
[]
[null,"<- Back to Home","Note: Finalise report (on Home tab) in order to refresh the reports below for WR1 and WR2"]
[]
[null,"Waste and Recycling"]
[]
[]
[null,null,"Indicator",{"$f":"ReportingYear","v":0},"%",null,"Indicator",{"$f":"ReportingYear","v":0},null,"Indicator",null,null,null,{"$f":"ReportingYear","v":0},"Final value column","Lookup - indicator","Indicator column","Lookup - segment","Segment column","Lookup - sheet"]
[null,null,null,null,null,null,"WR2. Percentage of office sites covered by dedicated collection services for each waste stream"]
[null,null,"WR1",null,null,null,null,null,null,{"$f":"\"WR3. Total units of waste disposed of normalised by \"&'Waste and Recycling'!M36&\" (kg)\"","v":"WR3. Total units of waste disposed of normalised by  (kg)"},null,null,null,{"$f":"SUMIFS(INDIRECT(\"'\"&T15&\"'!\"&O15&\":\"&O15),INDIRECT(\"'\"&T15&\"'!\"&Q15&\":\"&Q15),P15,INDIRECT(\"'\"&T15&\"'!\"&S15&\":\"&S15),R15)","v":0},"J","WR3","B","*","D","Waste and Recycling"]
[null,null,"Indicator","WR1",null,null,"Indicator","WR2",null,"N/A - hide"]
[null,null,"Segment Level 3","(blank)",null,null,"Segment Level 2","(blank)"]
[]
[null,null,"Row Labels","Sum of Final Value","Sum of Final Value2",null,"Row Labels","Sum of Final Value"]
[null,null,"Total units of waste disposed of by waste stream and disposal method (kg and %)",0,{"$error":"#DIV/0!"},null,"Printer cartridges",0]
[null,null,"Landfill (disposal)",0,{"$error":"#DIV/0!"},null,"Batteries",0,null,"WR4. Recycling Rate (%)",null,null,null,{"$f":"SUMIFS(INDIRECT(\"'\"&T21&\"'!\"&O21&\":\"&O21),INDIRECT(\"'\"&T21&\"'!\"&Q21&\":\"&Q21),P21,INDIRECT(\"'\"&T21&\"'!\"&S21&\":\"&S21),R21)","v":0},"J","WR4","B","*","D","Waste and Recycling"]
[null,null,"Landfill",0,{"$error":"#DIV/0!"},null,"e-waste",0]
[null,null,null,null,null,null,"Soft plastics",0,null,"WR5. Greenhouse gas emissions associated with waste disposal (Tonnes CO2-e)",null,null,null,{"$f":"SUMIFS(INDIRECT(\"'\"&T23&\"'!\"&O23&\":\"&O23),INDIRECT(\"'\"&T23&\"'!\"&Q23&\":\"&Q23),P23,INDIRECT(\"'\"&T23&\"'!\"&S23&\":\"&S23),R23)","v":0},"J","WR5","B","*","D","Waste and Recycling"]
[]
[null,null,null,null,null,null,null,null,null,null,"Landfill",null,null,{"$f":"SUMIFS(INDIRECT(\"'\"&T25&\"'!\"&O25&\":\"&O25),INDIRECT(\"'\"&T25&\"'!\"&Q25&\":\"&Q25),P25,INDIRECT(\"'\"&T25&\"'!\"&S25&\":\"&S25),R25)","v":0},"J","WR5.1","B","*","D","Waste and Recycling"]
[null,null,null,null,null,null,null,null,null,null,"Other",null,null,{"$f":"SUMIFS(INDIRECT(\"'\"&T26&\"'!\"&O26&\":\"&O26),INDIRECT(\"'\"&T26&\"'!\"&Q26&\":\"&Q26),P26,INDIRECT(\"'\"&T26&\"'!\"&S26&\":\"&S26),R26)","v":0},"J","WR5.3","B","*","D","Waste and Recycling"]

{"sheet":"Report - GHGs","index":7,"n_rows":34,"n_cols":14,"rows_kept":34,"cut":false,"hidden":true,"merged":[[5,1,5,6],[31,2,31,5]]}
[]
[]
[]
[]
[]
[null,{"$f":"Agency&\" | \"&Tier&\" | \"&ReportingPeriod","v":" |  |  - "}]
[]
[null,"<- Back to Home",null,null,null,null,null,null,null,null,null,null,null," "]
[]
[null,"Greenhouse Gas Emissions"]
[]
[null,null,"Indicator",null,null,null,{"$f":"ReportingYear","v":0},"Final value column","Lookup - indicator","Indicator column","Lookup - segment","Segment column","Lookup - sheet"]
[null,null,"G1. Total Scope 1 (direct) greenhouse gas emissions (CO2, CH4, N2O, other) (Tonnes CO2-e)",null,null,null,{"$f":"SUMIFS(INDIRECT(\"'\"&M13&\"'!\"&H13&\":\"&H13),INDIRECT(\"'\"&M13&\"'!\"&J13&\":\"&J13),I13,INDIRECT(\"'\"&M13&\"'!\"&L13&\":\"&L13),K13)","v":0},"J","G1","B","*","D","Greenhouse Gas Emissions"]
[null,null,null,"Total carbon dioxide (CO2)",null,null,{"$f":"SUMIFS(INDIRECT(\"'\"&M14&\"'!\"&H14&\":\"&H14),INDIRECT(\"'\"&M14&\"'!\"&J14&\":\"&J14),I14,INDIRECT(\"'\"&M14&\"'!\"&L14&\":\"&L14),K14)","v":0},"J","#G1 - CO2","B","*","D","Greenhouse Gas Emissions"]
[null,null,null,"Total methane (CH4)",null,null,0,"J","#G1 - CH4","B","*","D","Greenhouse Gas Emissions"]
[null,null,null,"Total nitrous oxide (N2O)",null,null,0,"J","#G1 - N2O","B","*","D","Greenhouse Gas Emissions"]
[null,null,null,"Total other",null,null,0,"J","#G1 - other","B","*","D","Greenhouse Gas Emissions"]
[null,null,null,"F2. Greenhouse gas emissions from stationary fuel consumption segmented by fuel type",null,null,{"$f":"SUMIFS(INDIRECT(\"'\"&M18&\"'!\"&H18&\":\"&H18),INDIRECT(\"'\"&M18&\"'!\"&J18&\":\"&J18),I18,INDIRECT(\"'\"&M18&\"'!\"&L18&\":\"&L18),K18)","v":0},"J","G1.1","B","*","D","Greenhouse Gas Emissions"]
[null,null,null,"T3. Greenhouse gas emissions from vehicle fleet segmented by fuel type and vehicle category",null,null,0,"J","G1.2","B","*","D","Greenhouse Gas Emissions"]
[null,null,null,"Fugitive emissions from wastewater treatment",null,null,0,"J","G1.4.1","B","*","D","Greenhouse Gas Emissions"]
[null,null,null,"Use of medical gases",null,null,0,"J","G1.3","B","*","D","Greenhouse Gas Emissions"]
[null,null,null,"Fugitive emissions from refrigeration and air conditioning ",null,null,{"$f":"SUM(G23:G24)","v":0},"n/a","n/a","n/a","n/a","n/a","n/a"]
[null,null,null,null,"Refrigeration leakage",null,0,"J","G1.4.2","B","*","D","Greenhouse Gas Emissions"]
[null,null,null,null,"Air Conditioning leakage",null,0,"J","G1.4.3","B","*","D","Greenhouse Gas Emissions"]
[null,null,null,"Fugitive emissions from electrical equipment",null,null,0,"J","G1.4.4","B","*","D","Greenhouse Gas Emissions"]
[null,null,null,"Fugitive emissions from fire suppression equipment  ",null,null,0,"J","G1.4.?","B","*frdsegmentsplitfire suppression equipment*","D","Greenhouse Gas Emissions"]
[null,null,null,"Other uses or releases of greenhouse gases through laboratory or workshop use",null,null,0,"J","G1.4.7","B","*","D","Greenhouse Gas Emissions"]
[null,null,null,"Any other material source of direct emissions within the Entity’s organisational boundary",null,null,0,"J","G1.4.8","B","*","D","Greenhouse Gas Emissions"]
[]
[null,null,"G2. Total Scope 2 (indirect electricity) greenhouse gas emissions (tonnes CO2-e) ",null,null,null,0,"J","G2","B","*","D","Greenhouse Gas Emissions"]
[]
[null,null,"G3. Total Scope 3 (Other indirect) greenhouse gas emissions associated with commercial air travel and waste disposal (tonnes CO2-e)",null,null,null,0,"J","G3","B","*","D","Greenhouse Gas Emissions"]
[null,null,null,"Waste disposal",null,null,0,"J","G3.2","B","*","D","Greenhouse Gas Emissions"]
[null,null,null,"Commercial air travel",null,null,0,"J","G3.1","B","*","D","Greenhouse Gas Emissions"]

{"sheet":"Electricity Use","index":8,"n_rows":73,"n_cols":18,"rows_kept":73,"cut":false,"hidden":false,"merged":[[5,1,5,6],[49,2,49,12],[63,2,63,12],[20,2,20,12],[12,2,12,12]]}
[]
[]
[]
[]
[]
[null,{"$f":"Agency&\" | \"&Tier&\" | \"&ReportingPeriod","v":" |  |  - "}]
[]
[null,"<- Back to Home",null,null,null,"Sheet complete:",null,{"$f":"IFERROR(IF(COUNTIF(O:O,\"Pass\")+COUNTIF(O:O,\"FAIL\")=0,\"NA\",IF(VLOOKUP(\"FAIL\",O:O,1,FALSE) = \"FAIL\", IF(COUNTIF(O:O,\"Pass\")=0,\"Not Started\",\"In Progress\"),\"Complete\")),\"Complete\")","v":"NA"}," "]
[null,null,null,null,null,null,null,{"$f":"IF(NOT(OR(H8=\"Complete\",H8=\"NA\")),\"*Mandatory values have not been entered, revisit highlighted items\",\"\")","v":""}]
[null,"Electricity Use - Reporting"]
[]
[]
[null,"EL1","Total electricity consumption segmented by source"]
[null,"ID","Parent ID","FRDSegment","Segment Level",null,null,"Description","Flag","Final Value","Final Unit","Input Type","Input Value","Input Unit","CHECK"]
["EL1","EL1","NA",{"$f":"IF(E15=1,H15,IFERROR(VLOOKUP(C15,$B$14:$D$1048576,3,FALSE)&\"FRDSegmentSplit\"&H15,H15))","v":"GRAND TOTAL"},{"$f":"IFERROR(LEN(B15)-LEN(SUBSTITUTE(B15,\".\",\"\") ),\"BAD VALUE\")","v":0},null,null,"GRAND TOTAL",{"$f":"IF(VLOOKUP(A15,TierIndicators,3,FALSE)=\"Yes\", \"Mandatory\", \"Optional\")","v":"Optional"},{"$f":"IF(N15=\"NA\", _xlfn.VALUETOTEXT(M15), M15*OFFSET(Admin!$AR$3,MATCH(N15,convSources,0),MATCH(K15,convTargets,0)))","v":0},"MWh","Segment Aggregation",{"$f":"SUMIF(C:C,B15,J:J)","v":0},"MWh",{"$f":"IF(OR(L15=\"Segment Aggregation\",L15=\"Auto-Calc\"),\"NA\",IF(AND(I15=\"Mandatory\",OR(M15=\"\",N15=\"\")), \"FAIL\", IF(I15=\"Optional\",\"NA\",\"PASS\")))","v":"NA"},null,"GRAND TOTAL"]
["EL1","EL1.1","EL1",{"$f":"IF(E16=1,H16,IFERROR(VLOOKUP(C16,$B$14:$D$1048576,3,FALSE)&\"FRDSegmentSplit\"&H16,H16))","v":"Purchased directly through an electricity retailer (including State Purchasing Contracts, HealthShare Victoria contracts or other retail contracts)"},{"$f":"IFERROR(LEN(B16)-LEN(SUBSTITUTE(B16,\".\",\"\") ),\"BAD VALUE\")","v":1},"+ (add segment)",null,"Purchased directly through an electricity retailer (including State Purchasing Contracts, HealthShare Victoria contracts or other retail contracts)",{"$f":"IF(VLOOKUP(A16,TierIndicators,3,FALSE)=\"Yes\", \"Mandatory\", \"Optional\")","v":"Optional"},{"$f":"IF(N16=\"NA\", _xlfn.VALUETOTEXT(M16), M16*OFFSET(Admin!$AR$3,MATCH(N16,convSources,0),MATCH(K16,convTargets,0)))","v":0},"MWh","Manual",null,"MWh",{"$f":"IF(OR(L16=\"Segment Aggregation\",L16=\"Auto-Calc\"),\"NA\",IF(AND(I16=\"Mandatory\",OR(M16=\"\",N16=\"\")), \"FAIL\", IF(I16=\"Optional\",\"NA\",\"PASS\")))","v":"NA"},null,"Purchased directly through an electricity retailer (including State Purchasing Contracts, HealthShare Victoria contracts or other retail contracts)",{"$f":"IF(VLOOKUP(A16,Calculations,MATCH(\"data imported?\",Admin!$Q$2:$V$2,0),0),\"calculation available\",\"import data from home tab to use calculations\")","v":"import data from home tab to use calculations"}]
["EL1","EL1.2","EL1",{"$f":"IF(E17=1,H17,IFERROR(VLOOKUP(C17,$B$14:$D$1048576,3,FALSE)&\"FRDSegmentSplit\"&H17,H17))","v":"Not directly purchased (e.g. tenancies that are not individually metered), but sourced from outside the organisation"},{"$f":"IFERROR(LEN(B17)-LEN(SUBSTITUTE(B17,\".\",\"\") ),\"BAD VALUE\")","v":1},"+ (add segment)",null,"Not directly purchased (e.g. tenancies that are not individually metered), but sourced from outside the organisation",{"$f":"IF(VLOOKUP(A17,TierIndicators,3,FALSE)=\"Yes\", \"Mandatory\", \"Optional\")","v":"Optional"},{"$f":"IF(N17=\"NA\", _xlfn.VALUETOTEXT(M17), M17*OFFSET(Admin!$AR$3,MATCH(N17,convSources,0),MATCH(K17,convTargets,0)))","v":0},"MWh","Manual",null,"MWh","NA",null,"Not directly purchased (e.g. tenancies that are not individually metered), but sourced from outside the organisation"]
["EL1","EL1.3","EL1",{"$f":"IF(E18=1,H18,IFERROR(VLOOKUP(C18,$B$14:$D$1048576,3,FALSE)&\"FRDSegmentSplit\"&H18,H18))","v":"Self-generated (if known)"},1,null,null,"Self-generated (if known)",{"$f":"IF(VLOOKUP(A18,TierIndicators,3,FALSE)=\"Yes\", \"Mandatory\", \"Optional\")","v":"Optional"},{"$f":"IF(N18=\"NA\", _xlfn.VALUETOTEXT(M18), M18*OFFSET(Admin!$AR$3,MATCH(N18,convSources,0),MATCH(K18,convTargets,0)))","v":0},"MWh","Auto-Calc",{"$f":"$J$24","v":0},"MWh","NA",null,"Self-generated (if known)"]
[]
[]
[null,"EL2","On site-electricity generated (in megawatt hours) for large-scale renewable energy systems, (i.e. accredited under the Large-Scale Renewable Energy Target (RET)), small-scale renewable energy systems (where data is available), and any other electricity generation system (where data is available), segmented by:"]
[null,"ID","Parent ID","FRDSegment","Segment Level",null,null,"Description","Flag","Final Value","Final Unit","Input Type","Input Value","Input Unit"]
["EL2","EL2","NA",{"$f":"IF(E23=1,H23,IFERROR(VLOOKUP(C23,$B$14:$D$1048576,3,FALSE)&\"FRDSegmentSplit\"&H23,H23))","v":"GRAND TOTAL"},{"$f":"IFERROR(LEN(B23)-LEN(SUBSTITUTE(B23,\".\",\"\") ),\"BAD VALUE\")","v":0},null,null,"GRAND TOTAL",{"$f":"IF(VLOOKUP(A23,TierIndicators,3,FALSE)=\"Yes\", \"Mandatory\", \"Optional\")","v":"Optional"},{"$f":"IF(N23=\"NA\", _xlfn.VALUETOTEXT(M23), M23*OFFSET(Admin!$AR$3,MATCH(N23,convSources,0),MATCH(K23,convTargets,0)))","v":0},"MWh","Segment Aggregation",{"$f":"SUMIF(C:C,B23,J:J)","v":0},"MWh",{"$f":"IF(OR(L23=\"Segment Aggregation\",L23=\"Auto-Calc\"),\"NA\",IF(AND(I23=\"Mandatory\",OR(M23=\"\",N23=\"\")), \"FAIL\", IF(I23=\"Optional\",\"NA\",\"PASS\")))","v":"NA"},null,"GRAND TOTAL"]
["EL2","EL2.1","EL2","Consumption behind-the-meter",{"$f":"IFERROR(LEN(B24)-LEN(SUBSTITUTE(B24,\".\",\"\") ),\"BAD VALUE\")","v":1},null,null,"Consumption behind-the-meter","Optional",{"$f":"IF(N24=\"NA\", _xlfn.VALUETOTEXT(M24), M24*OFFSET(Admin!$AR$3,MATCH(N24,convSources,0),MATCH(K24,convTargets,0)))","v":0},"MWh","Segment Aggregation",{"$f":"SUMIF(C:C,B24,J:J)","v":0},"MWh","NA",null,"Consumption behind-the-meter"]
["EL2","EL2.1.1","EL2.1","Consumption behind-the-meterFRDSegmentSplitWind",{"$f":"IFERROR(LEN(B25)-LEN(SUBSTITUTE(B25,\".\",\"\") ),\"BAD VALUE\")","v":2},"+ (add segment)",null,"Wind","Optional",{"$f":"IF(N25=\"NA\", _xlfn.VALUETOTEXT(M25), M25*OFFSET(Admin!$AR$3,MATCH(N25,convSources,0),MATCH(K25,convTargets,0)))","v":0},"MWh","Manual",null,"MWh","NA",null,"Wind"]
["EL2","EL2.1.2","EL2.1","Consumption behind-the-meterFRDSegmentSplitSolar PV",2,"+ (add segment)",null,"Solar PV","Optional",{"$f":"IF(N26=\"NA\", _xlfn.VALUETOTEXT(M26), M26*OFFSET(Admin!$AR$3,MATCH(N26,convSources,0),MATCH(K26,convTargets,0)))","v":0},"MWh","Manual",null,"MWh","NA",null,"Solar PV"]
["EL2","EL2.1.3","EL2.1","Consumption behind-the-meterFRDSegmentSplitBioenergy (including biogas from wastewater or landfill)",2,"+ (add segment)",null,"Bioenergy (including biogas from wastewater or landfill)","Optional",{"$f":"IF(N27=\"NA\", _xlfn.VALUETOTEXT(M27), M27*OFFSET(Admin!$AR$3,MATCH(N27,convSources,0),MATCH(K27,convTargets,0)))","v":0},"MWh","Manual",null,"MWh","NA",null,"Bioenergy"]
["EL2","EL2.1.4","EL2.1","Consumption behind-the-meterFRDSegmentSplitHydroelectric",2,"+ (add segment)",null,"Hydroelectric","Optional",{"$f":"IF(N28=\"NA\", _xlfn.VALUETOTEXT(M28), M28*OFFSET(Admin!$AR$3,MATCH(N28,convSources,0),MATCH(K28,convTargets,0)))","v":0},"MWh","Manual",null,"MWh","NA",null,"Hydroelectric"]
["EL2","EL2.1.5","EL2.1","Consumption behind-the-meterFRDSegmentSplitOther renewable (as defined by the Renewable Energy (Jobs and Investment) Act 2017)",2,"+ (add segment)",null,"Other renewable (as defined by the Renewable Energy (Jobs and Investment) Act 2017)","Optional",{"$f":"IF(N29=\"NA\", _xlfn.VALUETOTEXT(M29), M29*OFFSET(Admin!$AR$3,MATCH(N29,convSources,0),MATCH(K29,convTargets,0)))","v":0},"MWh","Manual",null,"MWh","NA",null,"Other renewable (as defined by the Renewable Energy (Jobs and Investment) Act 2017)"]
["EL2","EL2.1.6","EL2.1","Consumption behind-the-meterFRDSegmentSplitCogeneration (report electricity produced by cogeneration - energy used in cogeneration plant should also be reported under the 'all fuels' section)",2,"+ (add segment)",null,"Cogeneration (report electricity produced by cogeneration - energy used in cogeneration plant should also be reported under the 'all fuels' section)","Optional",{"$f":"IF(N30=\"NA\", _xlfn.VALUETOTEXT(M30), M30*OFFSET(Admin!$AR$3,MATCH(N30,convSources,0),MATCH(K30,convTargets,0)))","v":0},"MWh","Manual",null,"MWh","NA",null,"Cogeneration (report electricity produced by cogeneration - energy used in cogeneration plant should also be reported under the 'all fuels' section)"]
["EL2","EL2.1.7","EL2.1","Consumption behind-the-meterFRDSegmentSplitOther non-renewable",2,"+ (add segment)",null,"Other non-renewable","Optional",{"$f":"IF(N31=\"NA\", _xlfn.VALUETOTEXT(M31), M31*OFFSET(Admin!$AR$3,MATCH(N31,convSources,0),MATCH(K31,convTargets,0)))","v":0},"MWh","Manual",null,"MWh","NA",null,"Other non-renewable"]
["EL2","EL2.2","EL2","Exports",{"$f":"IFERROR(LEN(B32)-LEN(SUBSTITUTE(B32,\".\",\"\") ),\"BAD VALUE\")","v":1},null,null,"Exports","Optional",{"$f":"IF(N32=\"NA\", _xlfn.VALUETOTEXT(M32), M32*OFFSET(Admin!$AR$3,MATCH(N32,convSources,0),MATCH(K32,convTargets,0)))","v":0},"MWh","Segment Aggregation",{"$f":"SUMIF(C:C,B32,J:J)","v":0},"MWh","NA",null,"Exports"]
["EL2","EL2.2.1","EL2.2","ExportsFRDSegmentSplitWind",{"$f":"IFERROR(LEN(B33)-LEN(SUBSTITUTE(B33,\".\",\"\") ),\"BAD VALUE\")","v":2},"+ (add segment)",null,"Wind","Optional",{"$f":"IF(N33=\"NA\", _xlfn.VALUETOTEXT(M33), M33*OFFSET(Admin!$AR$3,MATCH(N33,convSources,0),MATCH(K33,convTargets,0)))","v":0},"MWh","Manual",null,"MWh","NA",null,"Wind"]
["EL2","EL2.2.2","EL2.2","ExportsFRDSegmentSplitSolar PV",2,"+ (add segment)",null,"Solar PV","Optional",{"$f":"IF(N34=\"NA\", _xlfn.VALUETOTEXT(M34), M34*OFFSET(Admin!$AR$3,MATCH(N34,convSources,0),MATCH(K34,convTargets,0)))","v":0},"MWh","Manual",null,"MWh","NA",null,"Solar PV"]
["EL2","EL2.2.3","EL2.2","ExportsFRDSegmentSplitBioenergy (including biogas from wastewater or landfill)",2,"+ (add segment)",null,"Bioenergy (including biogas from wastewater or landfill)","Optional",{"$f":"IF(N35=\"NA\", _xlfn.VALUETOTEXT(M35), M35*OFFSET(Admin!$AR$3,MATCH(N35,convSources,0),MATCH(K35,convTargets,0)))","v":0},"MWh","Manual",null,"MWh","NA",null,"Bioenergy"]
["EL2","EL2.2.4","EL2.2","ExportsFRDSegmentSplitHydroelectric",2,"+ (add segment)",null,"Hydroelectric","Optional",{"$f":"IF(N36=\"NA\", _xlfn.VALUETOTEXT(M36), M36*OFFSET(Admin!$AR$3,MATCH(N36,convSources,0),MATCH(K36,convTargets,0)))","v":0},"MWh","Manual",null,"MWh","NA",null,"Hydroelectric"]
["EL2","EL2.2.5","EL2.2","ExportsFRDSegmentSplitOther renewable (as defined by the Renewable Energy (Jobs and Investment) Act 2017)",2,"+ (add segment)",null,"Other renewable (as defined by the Renewable Energy (Jobs and Investment) Act 2017)","Optional",{"$f":"IF(N37=\"NA\", _xlfn.VALUETOTEXT(M37), M37*OFFSET(Admin!$AR$3,MATCH(N37,convSources,0),MATCH(K37,convTargets,0)))","v":0},"MWh","Manual",null,"MWh","NA",null,"Other renewable (as defined by the Renewable Energy (Jobs and Investment) Act 2017)"]
["EL2","EL2.2.6","EL2.2","ExportsFRDSegmentSplitCogeneration (report electricity produced by cogeneration - energy used in cogeneration plant should also be reported under the 'all fuels' section)",2,"+ (add segment)",null,"Cogeneration (report electricity produced by cogeneration - energy used in cogeneration plant should also be reported under the 'all fuels' section)","Optional",{"$f":"IF(N38=\"NA\", _xlfn.VALUETOTEXT(M38), M38*OFFSET(Admin!$AR$3,MATCH(N38,convSources,0),MATCH(K38,convTargets,0)))","v":0},"MWh","Manual",null,"MWh","NA",null,"Cogeneration (report electricity produced by cogeneration - energy used in cogeneration plant should also be reported under the 'all fuels' section)"]
["EL2","EL2.2.7","EL2.2","ExportsFRDSegmentSplitOther non-renewable",2,"+ (add segment)",null,"Other non-renewable","Optional",{"$f":"IF(N39=\"NA\", _xlfn.VALUETOTEXT(M39), M39*OFFSET(Admin!$AR$3,MATCH(N39,convSources,0),MATCH(K39,convTargets,0)))","v":0},"MWh","Manual",null,"MWh","NA",null,"Other non-renewable"]
["EL2","EL2.3","EL2","If relevant - For use outside the facility other than for supply to the grid",{"$f":"IFERROR(LEN(B40)-LEN(SUBSTITUTE(B40,\".\",\"\") ),\"BAD VALUE\")","v":1},null,null,"If relevant - For use outside the facility other than for supply to the grid","Optional",{"$f":"IF(N40=\"NA\", _xlfn.VALUETOTEXT(M40), M40*OFFSET(Admin!$AR$3,MATCH(N40,convSources,0),MATCH(K40,convTargets,0)))","v":0},"MWh","Segment Aggregation",{"$f":"SUMIF(C:C,B40,J:J)","v":0},"MWh","NA",null,"If relevant - For use outside the facility other than for supply to the grid"]
["EL2","EL2.3.1","EL2.3","If relevant - For use outside the facility other than for supply to the gridFRDSegmentSplitWind",{"$f":"IFERROR(LEN(B41)-LEN(SUBSTITUTE(B41,\".\",\"\") ),\"BAD VALUE\")","v":2},"+ (add segment)",null,"Wind","Optional",{"$f":"IF(N41=\"NA\", _xlfn.VALUETOTEXT(M41), M41*OFFSET(Admin!$AR$3,MATCH(N41,convSources,0),MATCH(K41,convTargets,0)))","v":0},"MWh","Manual",null,"MWh","NA",null,"Wind"]
["EL2","EL2.3.2","EL2.3","If relevant - For use outside the facility other than for supply to the gridFRDSegmentSplitSolar PV",2,"+ (add segment)",null,"Solar PV","Optional",{"$f":"IF(N42=\"NA\", _xlfn.VALUETOTEXT(M42), M42*OFFSET(Admin!$AR$3,MATCH(N42,convSources,0),MATCH(K42,convTargets,0)))","v":0},"MWh","Manual",null,"MWh","NA",null,"Solar PV"]
["EL2","EL2.3.3","EL2.3","If relevant - For use outside the facility other than for supply to the gridFRDSegmentSplitBioenergy (including biogas from wastewater or landfill)",2,"+ (add segment)",null,"Bioenergy (including biogas from wastewater or landfill)","Optional",{"$f":"IF(N43=\"NA\", _xlfn.VALUETOTEXT(M43), M43*OFFSET(Admin!$AR$3,MATCH(N43,convSources,0),MATCH(K43,convTargets,0)))","v":0},"MWh","Manual",null,"MWh","NA",null,"Bioenergy"]
["EL2","EL2.3.4","EL2.3","If relevant - For use outside the facility other than for supply to the gridFRDSegmentSplitHydroelectric",2,"+ (add segment)",null,"Hydroelectric","Optional",{"$f":"IF(N44=\"NA\", _xlfn.VALUETOTEXT(M44), M44*OFFSET(Admin!$AR$3,MATCH(N44,convSources,0),MATCH(K44,convTargets,0)))","v":0},"MWh","Manual",null,"MWh","NA",null,"Hydroelectric"]
["EL2","EL2.3.5","EL2.3","If relevant - For use outside the facility other than for supply to the gridFRDSegmentSplitOther renewable (as defined by the Renewable Energy (Jobs and Investment) Act 2017)",2,"+ (add segment)",null,"Other renewable (as defined by the Renewable Energy (Jobs and Investment) Act 2017)","Optional",{"$f":"IF(N45=\"NA\", _xlfn.VALUETOTEXT(M45), M45*OFFSET(Admin!$AR$3,MATCH(N45,convSources,0),MATCH(K45,convTargets,0)))","v":0},"MWh","Manual",null,"MWh","NA",null,"Other renewable (as defined by the Renewable Energy (Jobs and Investment) Act 2017)"]
["EL2","EL2.3.6","EL2.3","If relevant - For use outside the facility other than for supply to the gridFRDSegmentSplitCogeneration (report electricity produced by cogeneration - energy used in cogeneration plant should also be reported under the 'all fuels' section)",2,"+ (add segment)",null,"Cogeneration (report electricity produced by cogeneration - energy used in cogeneration plant should also be reported under the 'all fuels' section)","Optional",{"$f":"IF(N46=\"NA\", _xlfn.VALUETOTEXT(M46), M46*OFFSET(Admin!$AR$3,MATCH(N46,convSources,0),MATCH(K46,convTargets,0)))","v":0},"MWh","Manual",null,"MWh","NA",null,"Cogeneration (report electricity produced by cogeneration - energy used in cogeneration plant should also be reported under the 'all fuels' section)"]
["EL2","EL2.3.7","EL2.3","If relevant - For use outside the facility other than for supply to the gridFRDSegmentSplitOther non-renewable",2,"+ (add segment)",null,"Other non-renewable","Optional",{"$f":"IF(N47=\"NA\", _xlfn.VALUETOTEXT(M47), M47*OFFSET(Admin!$AR$3,MATCH(N47,convSources,0),MATCH(K47,convTargets,0)))","v":0},"MWh","Manual",null,"MWh","NA",null,"Other non-renewable"]
[]
[]
[null,"EL3","On-site installed generation capacity in megawatts (as at end of reporting period) segment by:"]
[null,"ID","Parent ID","FRDSegment","Segment Level",null,null,"Description","Flag","Final Value","Final Unit","Input Type","Input Value","Input Unit"]
["EL3","EL3","NA",{"$f":"IF(E52=1,H52,IFERROR(VLOOKUP(C52,$B$14:$D$1048576,3,FALSE)&\"FRDSegmentSplit\"&H52,H52))","v":"GRAND TOTAL"},{"$f":"IFERROR(LEN(B52)-LEN(SUBSTITUTE(B52,\".\",\"\") ),\"BAD VALUE\")","v":0},null,null,"GRAND TOTAL",{"$f":"IF(VLOOKUP(A52,TierIndicators,3,FALSE)=\"Yes\", \"Mandatory\", \"Optional\")","v":"Optional"},{"$f":"IF(N52=\"NA\", _xlfn.VALUETOTEXT(M52), M52*OFFSET(Admin!$AR$3,MATCH(N52,convSources,0),MATCH(K52,convTargets,0)))","v":0},"MW","Segment Aggregation",{"$f":"SUMIF(C:C,B52,J:J)-J59","v":0},"MW",{"$f":"IF(OR(L52=\"Segment Aggregation\",L52=\"Auto-Calc\"),\"NA\",IF(AND(I52=\"Mandatory\",OR(M52=\"\",N52=\"\")), \"FAIL\", IF(I52=\"Optional\",\"NA\",\"PASS\")))","v":"NA"},null,"GRAND TOTAL"]
["EL3","EL3.1","EL3","Wind",{"$f":"IFERROR(LEN(B53)-LEN(SUBSTITUTE(B53,\".\",\"\") ),\"BAD VALUE\")","v":1},"+ (add segment)",null,"Wind","Optional",{"$f":"IF(N53=\"NA\", _xlfn.VALUETOTEXT(M53), M53*OFFSET(Admin!$AR$3,MATCH(N53,convSources,0),MATCH(K53,convTargets,0)))","v":0},"MW","Manual",null,"MW","NA",null,"Wind"]
["EL3","EL3.2","EL3","Solar PV",1,"+ (add segment)",null,"Solar PV","Optional",{"$f":"IF(N54=\"NA\", _xlfn.VALUETOTEXT(M54), M54*OFFSET(Admin!$AR$3,MATCH(N54,convSources,0),MATCH(K54,convTargets,0)))","v":0},"MW","Manual",null,"MW","NA",null,"Solar PV"]
["EL3","EL3.3","EL3","Bioenergy (including biogas from wastewater or landfill)",1,"+ (add segment)",null,"Bioenergy (including biogas from wastewater or landfill)","Optional",{"$f":"IF(N55=\"NA\", _xlfn.VALUETOTEXT(M55), M55*OFFSET(Admin!$AR$3,MATCH(N55,convSources,0),MATCH(K55,convTargets,0)))","v":0},"MW","Manual",null,"MW","NA",null,"Bioenergy"]
["EL3","EL3.4","EL3","Hydroelectric",1,"+ (add segment)",null,"Hydroelectric","Optional",{"$f":"IF(N56=\"NA\", _xlfn.VALUETOTEXT(M56), M56*OFFSET(Admin!$AR$3,MATCH(N56,convSources,0),MATCH(K56,convTargets,0)))","v":0},"MW","Manual",null,"MW","NA",null,"Hydroelectric"]
["EL3","EL3.5","EL3","Other renewable (as defined by the Renewable Energy (Jobs and Investment) Act 2017)",1,"+ (add segment)",null,"Other renewable (as defined by the Renewable Energy (Jobs and Investment) Act 2017)","Optional",{"$f":"IF(N57=\"NA\", _xlfn.VALUETOTEXT(M57), M57*OFFSET(Admin!$AR$3,MATCH(N57,convSources,0),MATCH(K57,convTargets,0)))","v":0},"MW","Manual",null,"MW","NA",null,"Other renewable (as defined by the Renewable Energy (Jobs and Investment) Act 2017)"]
["EL3","EL3.6","EL3","Energy Storage Systems (power capacity)",1,"+ (add segment)",null,"Energy Storage Systems (power capacity)","Optional",{"$f":"IF(N58=\"NA\", _xlfn.VALUETOTEXT(M58), M58*OFFSET(Admin!$AR$3,MATCH(N58,convSources,0),MATCH(K58,convTargets,0)))","v":0},"MW","Manual",null,"MW","NA",null,"Energy Storage Systems (power capacity)"]
["EL3","EL3.7","EL3","Energy Storage Systems (total storage capacity)",1,"+ (add segment)",null,"Energy Storage Systems (total storage capacity)","Optional",{"$f":"IF(N59=\"NA\", _xlfn.VALUETOTEXT(M59), M59*OFFSET(Admin!$AR$3,MATCH(N59,convSources,0),MATCH(K59,convTargets,0)))","v":0},"MWh","Manual",null,"MWh","NA",null,"Energy Storage Systems (total storage capacity)"]
["EL3","EL3.8","EL3","Cogeneration",1,"+ (add segment)",null,"Cogeneration","Optional",{"$f":"IF(N60=\"NA\", _xlfn.VALUETOTEXT(M60), M60*OFFSET(Admin!$AR$3,MATCH(N60,convSources,0),MATCH(K60,convTargets,0)))","v":0},"MW","Manual",null,"MW","NA",null,"Cogeneration"]
["EL3","EL3.9","EL3","Other non-renewable (including standby power systems if relevant)",{"$f":"IFERROR(LEN(B61)-LEN(SUBSTITUTE(B61,\".\",\"\") ),\"BAD VALUE\")","v":1},"+ (add segment)",null,"Other non-renewable (including standby power systems if relevant)","Optional",{"$f":"IF(N61=\"NA\", _xlfn.VALUETOTEXT(M61), M61*OFFSET(Admin!$AR$3,MATCH(N61,convSources,0),MATCH(K61,convTargets,0)))","v":0},"MW","Manual",null,"MW","NA",null,"Other non-renewable (including standby power systems if relevant)"]
[]
[]
[null,"EL4","Total electricity offsets segmented by offset type"]
[null,"ID","Parent ID","FRDSegment","Segment Level",null,null,"Description","Flag","Final Value","Final Unit","Input Type","Input Value","Input Unit"]
["EL4","EL4","NA",{"$f":"IF(E66=1,H66,IFERROR(VLOOKUP(C66,$B$14:$D$1048576,3,FALSE)&\"FRDSegmentSplit\"&H66,H66))","v":"GRAND TOTAL"},{"$f":"IFERROR(LEN(B66)-LEN(SUBSTITUTE(B66,\".\",\"\") ),\"BAD VALUE\")","v":0},null,null,"GRAND TOTAL",{"$f":"IF(VLOOKUP(A66,TierIndicators,3,FALSE)=\"Yes\", \"Mandatory\", \"Optional\")","v":"Optional"},{"$f":"IF(N66=\"NA\", _xlfn.VALUETOTEXT(M66), M66*OFFSET(Admin!$AR$3,MATCH(N66,convSources,0),MATCH(K66,convTargets,0)))","v":0},"MWh","Segment Aggregation",{"$f":"SUMIF(C:C,B66,J:J)-J73","v":0},"MWh",{"$f":"IF(OR(L66=\"Segment Aggregation\",L66=\"Auto-Calc\"),\"NA\",IF(AND(I66=\"Mandatory\",OR(M66=\"\",N66=\"\")), \"FAIL\", IF(I66=\"Optional\",\"NA\",\"PASS\")))","v":"NA"},null,"GRAND TOTAL"]
["EL4","EL4.1","EL4","LGC's voluntarily retired by entity",{"$f":"IFERROR(LEN(B67)-LEN(SUBSTITUTE(B67,\".\",\"\") ),\"BAD VALUE\")","v":1},"+ (add segment)",null,"LGC's voluntarily retired by entity","Optional",{"$f":"IF(N67=\"NA\", _xlfn.VALUETOTEXT(M67), M67*OFFSET(Admin!$AR$3,MATCH(N67,convSources,0),MATCH(K67,convTargets,0)))","v":0},"MWh","Manual",null,"MWh","NA",null,"LGC's voluntarily retired by entity"]
["EL4","EL4.2","EL4","LGC's voluntarily retired on the entity's behalf",1,"+ (add segment)",null,"LGC's voluntarily retired on the entity's behalf","Optional",{"$f":"IF(N68=\"NA\", _xlfn.VALUETOTEXT(M68), M68*OFFSET(Admin!$AR$3,MATCH(N68,convSources,0),MATCH(K68,convTargets,0)))","v":0},"MWh","Manual",null,"MWh","NA",null,"LGC's voluntarily retired on the entity's behalf"]
["EL4","EL4.3","EL4","GreenPower or certified carbon neutral electricity purchased (eg. Through a retailer's contract option)",1,null,null,"GreenPower or certified carbon neutral electricity purchased (eg. Through a retailer's contract option)","Optional",{"$f":"IF(N69=\"NA\", _xlfn.VALUETOTEXT(M69), M69*OFFSET(Admin!$AR$3,MATCH(N69,convSources,0),MATCH(K69,convTargets,0)))","v":0},"MWh","Segment Aggregation",{"$f":"SUMIF(C:C,B69,J:J)","v":0},"MWh","NA",null,"GreenPower or certified carbon neutral electricity purchased (eg. Through a retailer's contract option)"]
["EL4","EL4.3.1","EL4.3","GreenPower or certified carbon neutral electricity purchased (eg. Through a retailer's contract option)FRDSegmentSplitGreenPower",{"$f":"IFERROR(LEN(B70)-LEN(SUBSTITUTE(B70,\".\",\"\") ),\"BAD VALUE\")","v":2},"+ (add segment)",null,"GreenPower","Optional",{"$f":"IF(N70=\"NA\", _xlfn.VALUETOTEXT(M70), M70*OFFSET(Admin!$AR$3,MATCH(N70,convSources,0),MATCH(K70,convTargets,0)))","v":0},"MWh","Manual",null,"MWh","NA",null,"GreenPower",{"$f":"IF(VLOOKUP(A70,Calculations,MATCH(\"data imported?\",Admin!$Q$2:$V$2,0),0),\"calculation available\",\"import data from home tab to use calculations\")","v":"import data from home tab to use calculations"}]
["EL4","EL4.3.2","EL4.3","GreenPower or certified carbon neutral electricity purchased (eg. Through a retailer's contract option)FRDSegmentSplitCertified climate active carbon neutral electricity purchased",{"$f":"IFERROR(LEN(B71)-LEN(SUBSTITUTE(B71,\".\",\"\") ),\"BAD VALUE\")","v":2},"+ (add segment)",null,"Certified climate active carbon neutral electricity purchased","Optional",{"$f":"IF(N71=\"NA\", _xlfn.VALUETOTEXT(M71), M71*OFFSET(Admin!$AR$3,MATCH(N71,convSources,0),MATCH(K71,convTargets,0)))","v":0},"MWh","Manual",null,"MWh","NA",null,"Certified climate active carbon neutral electricity purchased"]
["EL4","EL4.4","EL4","LGC's mandatorily retired (for RET liable entities only) or LGC's conveyed to an entity's retailer for mandatory retirement (where relevant)",1,"+ (add segment)",null,"LGC's mandatorily retired (for RET liable entities only) or LGC's conveyed to an entity's retailer for mandatory retirement (where relevant)","Optional",{"$f":"IF(N72=\"NA\", _xlfn.VALUETOTEXT(M72), M72*OFFSET(Admin!$AR$3,MATCH(N72,convSources,0),MATCH(K72,convTargets,0)))","v":0},"MWh","Manual",null,"MWh","NA",null,"LGC's mandatorily retired (for RET liable entities only) or LGC's conveyed to an entity's retailer for mandatory retirement (where relevant)"]
["EL4","EL4.5","EL4","LGC's associated with self-consumed / exported electricity and sold behind the meter",{"$f":"IFERROR(LEN(B73)-LEN(SUBSTITUTE(B73,\".\",\"\") ),\"BAD VALUE\")","v":1},"+ (add segment)",null,"LGC's associated with self-consumed / exported electricity and sold behind the meter",{"$f":"IF(VLOOKUP(A73,TierIndicators,3,FALSE)=\"Yes\", \"Mandatory\", \"Optional\")","v":"Optional"},{"$f":"IF(N73=\"NA\", _xlfn.VALUETOTEXT(M73), M73*OFFSET(Admin!$AR$3,MATCH(N73,convSources,0),MATCH(K73,convTargets,0)))","v":0},"MWh","Manual",null,"MWh",{"$f":"IF(OR(L73=\"Segment Aggregation\",L73=\"Auto-Calc\"),\"NA\",IF(AND(I73=\"Mandatory\",OR(M73=\"\",N73=\"\")), \"FAIL\", IF(I73=\"Optional\",\"NA\",\"PASS\")))","v":"NA"},null,"LGC's associated with self-consumed / exported electricity and sold behind the meter"]

{"sheet":"Stationary Fuel Use","index":9,"n_rows":66,"n_cols":21,"rows_kept":66,"cut":false,"hidden":false,"merged":[[5,1,5,6],[48,2,48,12],[12,2,12,12]]}
[]
[]
[]
[]
[]
[null,{"$f":"Agency&\" | \"&Tier&\" | \"&ReportingPeriod","v":" |  |  - "}]
[]
[null,"<- Back to Home",null,null,null,"Sheet complete:",null,{"$f":"IFERROR(IF(COUNTIF(O:O,\"Pass\")+COUNTIF(O:O,\"FAIL\")=0,\"NA\",IF(VLOOKUP(\"FAIL\",O:O,1,FALSE) = \"FAIL\", IF(COUNTIF(O:O,\"Pass\")=0,\"Not Started\",\"In Progress\"),\"Complete\")),\"Complete\")","v":"NA"}," "]
[null,null,null,null,null,null,null,{"$f":"IF(NOT(OR(H8=\"Complete\",H8=\"NA\")),\"*Mandatory values have not been entered, revisit highlighted items\",\"\")","v":""}]
[null,"Stationary Fuel Use - Reporting"]
[]
[]
[null,"F1","Total fuels used in buildings and machinery segmented by fuel type (MJ)"]
[null,"ID","Parent ID","FRDSegment","Segment Level",null,null,"Description","Flag","Final Value","Final Unit","Input Type","Input Value","Input Unit","CHECK"]
["F1","F1","NA",{"$f":"IF(E15=1,H15,IFERROR(VLOOKUP(C15,$B$14:$D$1048576,3,FALSE)&\"FRDSegmentSplit\"&H15,H15))","v":"GRAND TOTAL"},{"$f":"IFERROR(LEN(B15)-LEN(SUBSTITUTE(B15,\".\",\"\") ),\"BAD VALUE\")","v":0},null,null,"GRAND TOTAL",{"$f":"IF(VLOOKUP(A15,TierIndicators,3,FALSE)=\"Yes\", \"Mandatory\", \"Optional\")","v":"Optional"},{"$f":"IF(N15=\"NA\",_xlfn.VALUETOTEXT(M15),M15*IF(OR(N15=\"L\", N15=\"kL\"),VLOOKUP(\"F2-\"&Q15,Admin!BN:BT,5,FALSE)*IF(N15=\"kL\",1000,1)*OFFSET(Admin!$AR$3,MATCH(\"GJ\",convSources,0),MATCH(K15,convTargets,0)),IF(OR(N15=\"Kg\",N15=\"Tonnes\"),VLOOKUP(\"F2-\"&Q15,Admin!BN:BT,6,FALSE)*IF(N15=\"Tonnes\",1000,1)*OFFSET(Admin!$AR$3,MATCH(\"GJ\",convSources,0),MATCH(K15,convTargets,0)),IF(N15=\"m3\",VLOOKUP(\"F2-\"&Q15,Admin!BN:BT,7,FALSE)*OFFSET(Admin!$AR$3,MATCH(\"GJ\",convSources,0),MATCH(K15,convTargets,0)),OFFSET(Admin!$AR$3,MATCH(N15,convSources,0),MATCH(K15,convTargets,0))))))","v":0},"MJ","Segment Aggregation",{"$f":"SUMIF(C:C,B15,J:J)","v":0},"MJ",{"$f":"IF(OR(L15=\"Segment Aggregation\",L15=\"Auto-Calc\"),\"NA\",IF(AND(I15=\"Mandatory\",OR(M15=\"\",N15=\"\")), \"FAIL\", IF(I15=\"Optional\",\"NA\",\"PASS\")))","v":"NA"},null,"GRAND TOTAL"]
["F1","F1.1","F1","Buildings (fuel used in heating, cooling, cooking, and the provision of other building services)",{"$f":"IFERROR(LEN(B16)-LEN(SUBSTITUTE(B16,\".\",\"\") ),\"BAD VALUE\")","v":1},null,null,"Buildings (fuel used in heating, cooling, cooking, and the provision of other building services)","Optional",{"$f":"IF(N16=\"NA\",_xlfn.VALUETOTEXT(M16),M16*IF(OR(N16=\"L\", N16=\"kL\"),VLOOKUP(\"F2-\"&Q16,Admin!BN:BT,5,FALSE)*IF(N16=\"kL\",1000,1)*OFFSET(Admin!$AR$3,MATCH(\"GJ\",convSources,0),MATCH(K16,convTargets,0)),IF(OR(N16=\"Kg\",N16=\"Tonnes\"),VLOOKUP(\"F2-\"&Q16,Admin!BN:BT,6,FALSE)*IF(N16=\"Tonnes\",1000,1)*OFFSET(Admin!$AR$3,MATCH(\"GJ\",convSources,0),MATCH(K16,convTargets,0)),IF(N16=\"m3\",VLOOKUP(\"F2-\"&Q16,Admin!BN:BT,7,FALSE)*OFFSET(Admin!$AR$3,MATCH(\"GJ\",convSources,0),MATCH(K16,convTargets,0)),OFFSET(Admin!$AR$3,MATCH(N16,convSources,0),MATCH(K16,convTargets,0))))))","v":0},"MJ","Segment Aggregation",{"$f":"SUMIF(C:C,B16,J:J)","v":0},"MJ","NA",null,"Buildings (fuel used in heating, cooling, cooking, and the provision of other building services)\n"]
["F1","F1.1.1","F1.1","Buildings (fuel used in heating, cooling, cooking, and the provision of other building services)FRDSegmentSplitNatural gas",{"$f":"IFERROR(LEN(B17)-LEN(SUBSTITUTE(B17,\".\",\"\") ),\"BAD VALUE\")","v":2},"+ (add segment)",null,"Natural gas","Optional",{"$f":"IF(N17=\"NA\",_xlfn.VALUETOTEXT(M17),M17*IF(OR(N17=\"L\", N17=\"kL\"),VLOOKUP(\"F2-\"&Q17,Admin!BN:BT,5,FALSE)*IF(N17=\"kL\",1000,1)*OFFSET(Admin!$AR$3,MATCH(\"GJ\",convSources,0),MATCH(K17,convTargets,0)),IF(OR(N17=\"Kg\",N17=\"Tonnes\"),VLOOKUP(\"F2-\"&Q17,Admin!BN:BT,6,FALSE)*IF(N17=\"Tonnes\",1000,1)*OFFSET(Admin!$AR$3,MATCH(\"GJ\",convSources,0),MATCH(K17,convTargets,0)),IF(N17=\"m3\",VLOOKUP(\"F2-\"&Q17,Admin!BN:BT,7,FALSE)*OFFSET(Admin!$AR$3,MATCH(\"GJ\",convSources,0),MATCH(K17,convTargets,0)),OFFSET(Admin!$AR$3,MATCH(N17,convSources,0),MATCH(K17,convTargets,0))))))","v":0},"MJ","Manual",null,"m3","NA",null,"Natural gas",null,null,null,{"$f":"IF(VLOOKUP(A17,Calculations,MATCH(\"data imported?\",Admin!$Q$2:$V$2,0),0),\"calculation available\",\"import data from home tab to use calculations\")","v":"import data from home tab to use calculations"}]
["F1","F1.1.2","F1.1","Buildings (fuel used in heating, cooling, cooking, and the provision of other building services)FRDSegmentSplitLPG",{"$f":"IFERROR(LEN(B18)-LEN(SUBSTITUTE(B18,\".\",\"\") ),\"BAD VALUE\")","v":2},"+ (add segment)",null,"LPG","Optional",{"$f":"IF(N18=\"NA\",_xlfn.VALUETOTEXT(M18),M18*IF(OR(N18=\"L\", N18=\"kL\"),VLOOKUP(\"F2-\"&Q18,Admin!BN:BT,5,FALSE)*IF(N18=\"kL\",1000,1)*OFFSET(Admin!$AR$3,MATCH(\"GJ\",convSources,0),MATCH(K18,convTargets,0)),IF(OR(N18=\"Kg\",N18=\"Tonnes\"),VLOOKUP(\"F2-\"&Q18,Admin!BN:BT,6,FALSE)*IF(N18=\"Tonnes\",1000,1)*OFFSET(Admin!$AR$3,MATCH(\"GJ\",convSources,0),MATCH(K18,convTargets,0)),IF(N18=\"m3\",VLOOKUP(\"F2-\"&Q18,Admin!BN:BT,7,FALSE)*OFFSET(Admin!$AR$3,MATCH(\"GJ\",convSources,0),MATCH(K18,convTargets,0)),OFFSET(Admin!$AR$3,MATCH(N18,convSources,0),MATCH(K18,convTargets,0))))))","v":0},"MJ","Manual",null,"MJ","NA",null,"LPG"]
["F1","F1.1.3","F1.1","Buildings (fuel used in heating, cooling, cooking, and the provision of other building services)FRDSegmentSplitDiesel",2,"+ (add segment)",null,"Diesel","Optional",{"$f":"IF(N19=\"NA\",_xlfn.VALUETOTEXT(M19),M19*IF(OR(N19=\"L\", N19=\"kL\"),VLOOKUP(\"F2-\"&Q19,Admin!BN:BT,5,FALSE)*IF(N19=\"kL\",1000,1)*OFFSET(Admin!$AR$3,MATCH(\"GJ\",convSources,0),MATCH(K19,convTargets,0)),IF(OR(N19=\"Kg\",N19=\"Tonnes\"),VLOOKUP(\"F2-\"&Q19,Admin!BN:BT,6,FALSE)*IF(N19=\"Tonnes\",1000,1)*OFFSET(Admin!$AR$3,MATCH(\"GJ\",convSources,0),MATCH(K19,convTargets,0)),IF(N19=\"m3\",VLOOKUP(\"F2-\"&Q19,Admin!BN:BT,7,FALSE)*OFFSET(Admin!$AR$3,MATCH(\"GJ\",convSources,0),MATCH(K19,convTargets,0)),OFFSET(Admin!$AR$3,MATCH(N19,convSources,0),MATCH(K19,convTargets,0))))))","v":0},"MJ","Manual",null,"kL","NA",null,"Diesel"]
["F1","F1.1.4","F1.1","Buildings (fuel used in heating, cooling, cooking, and the provision of other building services)FRDSegmentSplitPetrol",{"$f":"IFERROR(LEN(B20)-LEN(SUBSTITUTE(B20,\".\",\"\") ),\"BAD VALUE\")","v":2},"+ (add segment)",null,"Petrol","Optional",{"$f":"IF(N20=\"NA\",_xlfn.VALUETOTEXT(M20),M20*IF(OR(N20=\"L\", N20=\"kL\"),VLOOKUP(\"F2-\"&Q20,Admin!BN:BT,5,FALSE)*IF(N20=\"kL\",1000,1)*OFFSET(Admin!$AR$3,MATCH(\"GJ\",convSources,0),MATCH(K20,convTargets,0)),IF(OR(N20=\"Kg\",N20=\"Tonnes\"),VLOOKUP(\"F2-\"&Q20,Admin!BN:BT,6,FALSE)*IF(N20=\"Tonnes\",1000,1)*OFFSET(Admin!$AR$3,MATCH(\"GJ\",convSources,0),MATCH(K20,convTargets,0)),IF(N20=\"m3\",VLOOKUP(\"F2-\"&Q20,Admin!BN:BT,7,FALSE)*OFFSET(Admin!$AR$3,MATCH(\"GJ\",convSources,0),MATCH(K20,convTargets,0)),OFFSET(Admin!$AR$3,MATCH(N20,convSources,0),MATCH(K20,convTargets,0))))))","v":0},"MJ","Manual",null,"kL","NA",null,"Petrol"]
["F1","F1.1.5","F1.1","Buildings (fuel used in heating, cooling, cooking, and the provision of other building services)FRDSegmentSplitHydrogen",{"$f":"IFERROR(LEN(B21)-LEN(SUBSTITUTE(B21,\".\",\"\") ),\"BAD VALUE\")","v":2},"+ (add segment)",null,"Hydrogen","Optional",{"$f":"IF(N21=\"NA\",_xlfn.VALUETOTEXT(M21),M21*IF(OR(N21=\"L\", N21=\"kL\"),VLOOKUP(\"F2-\"&Q21,Admin!BN:BT,5,FALSE)*IF(N21=\"kL\",1000,1)*OFFSET(Admin!$AR$3,MATCH(\"MJ\",convSources,0),MATCH(K21,convTargets,0)),IF(OR(N21=\"Kg\",N21=\"Tonnes\"),VLOOKUP(\"F2-\"&Q21,Admin!BN:BT,6,FALSE)*IF(N21=\"Tonnes\",1000,1)*OFFSET(Admin!$AR$3,MATCH(\"MJ\",convSources,0),MATCH(K21,convTargets,0)),IF(N21=\"m3\",VLOOKUP(\"F2-\"&Q21,Admin!BN:BT,7,FALSE)*OFFSET(Admin!$AR$3,MATCH(\"MJ\",convSources,0),MATCH(K21,convTargets,0)),OFFSET(Admin!$AR$3,MATCH(N21,convSources,0),MATCH(K21,convTargets,0))))))","v":0},"MJ","Manual",null,"Kg","NA",null,"Hydrogen"]
["F1","F1.1.6","F1.1","Buildings (fuel used in heating, cooling, cooking, and the provision of other building services)FRDSegmentSplitFuel oil",{"$f":"IFERROR(LEN(B22)-LEN(SUBSTITUTE(B22,\".\",\"\") ),\"BAD VALUE\")","v":2},"+ (add segment)",null,"Fuel oil",{"$f":"IF(VLOOKUP(A22,TierIndicators,3,FALSE)=\"Yes\", \"Mandatory\", \"Optional\")","v":"Optional"},{"$f":"IF(N22=\"NA\",_xlfn.VALUETOTEXT(M22),M22*IF(OR(N22=\"L\", N22=\"kL\"),VLOOKUP(\"F2-\"&Q22,Admin!BN:BT,5,FALSE)*IF(N22=\"kL\",1000,1)*OFFSET(Admin!$AR$3,MATCH(\"GJ\",convSources,0),MATCH(K22,convTargets,0)),IF(OR(N22=\"Kg\",N22=\"Tonnes\"),VLOOKUP(\"F2-\"&Q22,Admin!BN:BT,6,FALSE)*IF(N22=\"Tonnes\",1000,1)*OFFSET(Admin!$AR$3,MATCH(\"GJ\",convSources,0),MATCH(K22,convTargets,0)),IF(N22=\"m3\",VLOOKUP(\"F2-\"&Q22,Admin!BN:BT,7,FALSE)*OFFSET(Admin!$AR$3,MATCH(\"GJ\",convSources,0),MATCH(K22,convTargets,0)),OFFSET(Admin!$AR$3,MATCH(N22,convSources,0),MATCH(K22,convTargets,0))))))","v":0},"MJ","Manual",null,"MJ",{"$f":"IF(OR(L22=\"Segment Aggregation\",L22=\"Auto-Calc\"),\"NA\",IF(AND(I22=\"Mandatory\",OR(M22=\"\",N22=\"\")), \"FAIL\", IF(I22=\"Optional\",\"NA\",\"PASS\")))","v":"NA"},null,"Fuel oil"]
["F1","F1.1.7","F1.1","Buildings (fuel used in heating, cooling, cooking, and the provision of other building services)FRDSegmentSplitSolid fuel",2,null,null,"Solid fuel","Optional",{"$f":"IF(N23=\"NA\",_xlfn.VALUETOTEXT(M23),M23*IF(OR(N23=\"L\", N23=\"kL\"),VLOOKUP(\"F2-\"&Q23,Admin!BN:BT,5,FALSE)*IF(N23=\"kL\",1000,1)*OFFSET(Admin!$AR$3,MATCH(\"GJ\",convSources,0),MATCH(K23,convTargets,0)),IF(OR(N23=\"Kg\",N23=\"Tonnes\"),VLOOKUP(\"F2-\"&Q23,Admin!BN:BT,6,FALSE)*IF(N23=\"Tonnes\",1000,1)*OFFSET(Admin!$AR$3,MATCH(\"GJ\",convSources,0),MATCH(K23,convTargets,0)),IF(N23=\"m3\",VLOOKUP(\"F2-\"&Q23,Admin!BN:BT,7,FALSE)*OFFSET(Admin!$AR$3,MATCH(\"GJ\",convSources,0),MATCH(K23,convTargets,0)),OFFSET(Admin!$AR$3,MATCH(N23,convSources,0),MATCH(K23,convTargets,0))))))","v":0},"MJ","Segment Aggregation",{"$f":"SUMIF(C:C,B23,J:J)","v":0},"MJ","NA",null,"Solid fuel"]
["F1","F1.1.7.1","F1.1.7","Buildings (fuel used in heating, cooling, cooking, and the provision of other building services)FRDSegmentSplitSolid fuelFRDSegmentSplitDry wood",3,"+ (add segment)",null,"Dry wood",{"$f":"IF(VLOOKUP(A24,TierIndicators,3,FALSE)=\"Yes\", \"Mandatory\", \"Optional\")","v":"Optional"},{"$f":"IF(N24=\"NA\",_xlfn.VALUETOTEXT(M24),M24*IF(OR(N24=\"L\", N24=\"kL\"),VLOOKUP(\"F2-\"&Q24,Admin!BN:BT,5,FALSE)*IF(N24=\"kL\",1000,1)*OFFSET(Admin!$AR$3,MATCH(\"GJ\",convSources,0),MATCH(K24,convTargets,0)),IF(OR(N24=\"Kg\",N24=\"Tonnes\"),VLOOKUP(\"F2-\"&Q24,Admin!BN:BT,6,FALSE)*IF(N24=\"Tonnes\",1000,1)*OFFSET(Admin!$AR$3,MATCH(\"GJ\",convSources,0),MATCH(K24,convTargets,0)),IF(N24=\"m3\",VLOOKUP(\"F2-\"&Q24,Admin!BN:BT,7,FALSE)*OFFSET(Admin!$AR$3,MATCH(\"GJ\",convSources,0),MATCH(K24,convTargets,0)),OFFSET(Admin!$AR$3,MATCH(N24,convSources,0),MATCH(K24,convTargets,0))))))","v":0},"MJ","Manual",null,"Tonnes","NA",null,"Dry wood"]
["F1","F1.1.7.2","F1.1.7","Buildings (fuel used in heating, cooling, cooking, and the provision of other building services)FRDSegmentSplitSolid fuelFRDSegmentSplitGreen and air dried wood",3,"+ (add segment)",null,"Green and air dried wood","Optional",{"$f":"IF(N25=\"NA\",_xlfn.VALUETOTEXT(M25),M25*IF(OR(N25=\"L\", N25=\"kL\"),VLOOKUP(\"F2-\"&Q25,Admin!BN:BT,5,FALSE)*IF(N25=\"kL\",1000,1)*OFFSET(Admin!$AR$3,MATCH(\"GJ\",convSources,0),MATCH(K25,convTargets,0)),IF(OR(N25=\"Kg\",N25=\"Tonnes\"),VLOOKUP(\"F2-\"&Q25,Admin!BN:BT,6,FALSE)*IF(N25=\"Tonnes\",1000,1)*OFFSET(Admin!$AR$3,MATCH(\"GJ\",convSources,0),MATCH(K25,convTargets,0)),IF(N25=\"m3\",VLOOKUP(\"F2-\"&Q25,Admin!BN:BT,7,FALSE)*OFFSET(Admin!$AR$3,MATCH(\"GJ\",convSources,0),MATCH(K25,convTargets,0)),OFFSET(Admin!$AR$3,MATCH(N25,convSources,0),MATCH(K25,convTargets,0))))))","v":0},"MJ","Manual",null,"Tonnes","NA",null,"Green and air dried wood"]
["F1","F1.1.7.3","F1.1.7","Buildings (fuel used in heating, cooling, cooking, and the provision of other building services)FRDSegmentSplitSolid fuelFRDSegmentSplitBagasse",3,"+ (add segment)",null,"Bagasse","Optional",{"$f":"IF(N26=\"NA\",_xlfn.VALUETOTEXT(M26),M26*IF(OR(N26=\"L\", N26=\"kL\"),VLOOKUP(\"F2-\"&Q26,Admin!BN:BT,5,FALSE)*IF(N26=\"kL\",1000,1)*OFFSET(Admin!$AR$3,MATCH(\"GJ\",convSources,0),MATCH(K26,convTargets,0)),IF(OR(N26=\"Kg\",N26=\"Tonnes\"),VLOOKUP(\"F2-\"&Q26,Admin!BN:BT,6,FALSE)*IF(N26=\"Tonnes\",1000,1)*OFFSET(Admin!$AR$3,MATCH(\"GJ\",convSources,0),MATCH(K26,convTargets,0)),IF(N26=\"m3\",VLOOKUP(\"F2-\"&Q26,Admin!BN:BT,7,FALSE)*OFFSET(Admin!$AR$3,MATCH(\"GJ\",convSources,0),MATCH(K26,convTargets,0)),OFFSET(Admin!$AR$3,MATCH(N26,convSources,0),MATCH(K26,convTargets,0))))))","v":0},"MJ","Manual",null,"Tonnes","NA",null,"Bagasse"]
["F1","F1.1.7.4","F1.1.7","Buildings (fuel used in heating, cooling, cooking, and the provision of other building services)FRDSegmentSplitSolid fuelFRDSegmentSplitBiomass municipal and other industrial materials",3,"+ (add segment)",null,"Biomass municipal and other industrial materials","Optional",{"$f":"IF(N27=\"NA\",_xlfn.VALUETOTEXT(M27),M27*IF(OR(N27=\"L\", N27=\"kL\"),VLOOKUP(\"F2-\"&Q27,Admin!BN:BT,5,FALSE)*IF(N27=\"kL\",1000,1)*OFFSET(Admin!$AR$3,MATCH(\"GJ\",convSources,0),MATCH(K27,convTargets,0)),IF(OR(N27=\"Kg\",N27=\"Tonnes\"),VLOOKUP(\"F2-\"&Q27,Admin!BN:BT,6,FALSE)*IF(N27=\"Tonnes\",1000,1)*OFFSET(Admin!$AR$3,MATCH(\"GJ\",convSources,0),MATCH(K27,convTargets,0)),IF(N27=\"m3\",VLOOKUP(\"F2-\"&Q27,Admin!BN:BT,7,FALSE)*OFFSET(Admin!$AR$3,MATCH(\"GJ\",convSources,0),MATCH(K27,convTargets,0)),OFFSET(Admin!$AR$3,MATCH(N27,convSources,0),MATCH(K27,convTargets,0))))))","v":0},"MJ","Manual",null,"Tonnes","NA",null,"Biomass municipal and other industrial materials"]
["F1","F1.1.7.5","F1.1.7","Buildings (fuel used in heating, cooling, cooking, and the provision of other building services)FRDSegmentSplitSolid fuelFRDSegmentSplitCharcoal",3,"+ (add segment)",null,"Charcoal","Optional",{"$f":"IF(N28=\"NA\",_xlfn.VALUETOTEXT(M28),M28*IF(OR(N28=\"L\", N28=\"kL\"),VLOOKUP(\"F2-\"&Q28,Admin!BN:BT,5,FALSE)*IF(N28=\"kL\",1000,1)*OFFSET(Admin!$AR$3,MATCH(\"GJ\",convSources,0),MATCH(K28,convTargets,0)),IF(OR(N28=\"Kg\",N28=\"Tonnes\"),VLOOKUP(\"F2-\"&Q28,Admin!BN:BT,6,FALSE)*IF(N28=\"Tonnes\",1000,1)*OFFSET(Admin!$AR$3,MATCH(\"GJ\",convSources,0),MATCH(K28,convTargets,0)),IF(N28=\"m3\",VLOOKUP(\"F2-\"&Q28,Admin!BN:BT,7,FALSE)*OFFSET(Admin!$AR$3,MATCH(\"GJ\",convSources,0),MATCH(K28,convTargets,0)),OFFSET(Admin!$AR$3,MATCH(N28,convSources,0),MATCH(K28,convTargets,0))))))","v":0},"MJ","Manual",null,"Tonnes","NA",null,"Charcoal"]
["F1","F1.1.7.6","F1.1.7","Buildings (fuel used in heating, cooling, cooking, and the provision of other building services)FRDSegmentSplitSolid fuelFRDSegmentSplitAnthracite coal",{"$f":"IFERROR(LEN(B29)-LEN(SUBSTITUTE(B29,\".\",\"\") ),\"BAD VALUE\")","v":3},"+ (add segment)",null,"Anthracite coal",{"$f":"IF(VLOOKUP(A29,TierIndicators,3,FALSE)=\"Yes\", \"Mandatory\", \"Optional\")","v":"Optional"},{"$f":"IF(N29=\"NA\",_xlfn.VALUETOTEXT(M29),M29*IF(OR(N29=\"L\", N29=\"kL\"),VLOOKUP(\"F2-\"&Q29,Admin!BN:BT,5,FALSE)*IF(N29=\"kL\",1000,1)*OFFSET(Admin!$AR$3,MATCH(\"GJ\",convSources,0),MATCH(K29,convTargets,0)),IF(OR(N29=\"Kg\",N29=\"Tonnes\"),VLOOKUP(\"F2-\"&Q29,Admin!BN:BT,6,FALSE)*IF(N29=\"Tonnes\",1000,1)*OFFSET(Admin!$AR$3,MATCH(\"GJ\",convSources,0),MATCH(K29,convTargets,0)),IF(N29=\"m3\",VLOOKUP(\"F2-\"&Q29,Admin!BN:BT,7,FALSE)*OFFSET(Admin!$AR$3,MATCH(\"GJ\",convSources,0),MATCH(K29,convTargets,0)),OFFSET(Admin!$AR$3,MATCH(N29,convSources,0),MATCH(K29,convTargets,0))))))","v":0},"MJ","Manual",null,"Tonnes",{"$f":"IF(OR(L29=\"Segment Aggregation\",L29=\"Auto-Calc\"),\"NA\",IF(AND(I29=\"Mandatory\",OR(M29=\"\",N29=\"\")), \"FAIL\", IF(I29=\"Optional\",\"NA\",\"PASS\")))","v":"NA"},null,"Anthracite coal"]
["F1","F1.1.7.7","F1.1.7","Buildings (fuel used in heating, cooling, cooking, and the provision of other building services)FRDSegmentSplitSolid fuelFRDSegmentSplitBituminous coal",{"$f":"IFERROR(LEN(B30)-LEN(SUBSTITUTE(B30,\".\",\"\") ),\"BAD VALUE\")","v":3},"+ (add segment)",null,"Bituminous coal",{"$f":"IF(VLOOKUP(A30,TierIndicators,3,FALSE)=\"Yes\", \"Mandatory\", \"Optional\")","v":"Optional"},{"$f":"IF(N30=\"NA\",_xlfn.VALUETOTEXT(M30),M30*IF(OR(N30=\"L\", N30=\"kL\"),VLOOKUP(\"F2-\"&Q30,Admin!BN:BT,5,FALSE)*IF(N30=\"kL\",1000,1)*OFFSET(Admin!$AR$3,MATCH(\"GJ\",convSources,0),MATCH(K30,convTargets,0)),IF(OR(N30=\"Kg\",N30=\"Tonnes\"),VLOOKUP(\"F2-\"&Q30,Admin!BN:BT,6,FALSE)*IF(N30=\"Tonnes\",1000,1)*OFFSET(Admin!$AR$3,MATCH(\"GJ\",convSources,0),MATCH(K30,convTargets,0)),IF(N30=\"m3\",VLOOKUP(\"F2-\"&Q30,Admin!BN:BT,7,FALSE)*OFFSET(Admin!$AR$3,MATCH(\"GJ\",convSources,0),MATCH(K30,convTargets,0)),OFFSET(Admin!$AR$3,MATCH(N30,convSources,0),MATCH(K30,convTargets,0))))))","v":0},"MJ","Manual",null,"Tonnes",{"$f":"IF(OR(L30=\"Segment Aggregation\",L30=\"Auto-Calc\"),\"NA\",IF(AND(I30=\"Mandatory\",OR(M30=\"\",N30=\"\")), \"FAIL\", IF(I30=\"Optional\",\"NA\",\"PASS\")))","v":"NA"},null,"Bituminous coal"]
["F1","F1.1.7.8","F1.1.7","Buildings (fuel used in heating, cooling, cooking, and the provision of other building services)FRDSegmentSplitSolid fuelFRDSegmentSplitCoal briquettes",{"$f":"IFERROR(LEN(B31)-LEN(SUBSTITUTE(B31,\".\",\"\") ),\"BAD VALUE\")","v":3},"+ (add segment)",null,"Coal briquettes",{"$f":"IF(VLOOKUP(A31,TierIndicators,3,FALSE)=\"Yes\", \"Mandatory\", \"Optional\")","v":"Optional"},{"$f":"IF(N31=\"NA\",_xlfn.VALUETOTEXT(M31),M31*IF(OR(N31=\"L\", N31=\"kL\"),VLOOKUP(\"F2-\"&Q31,Admin!BN:BT,5,FALSE)*IF(N31=\"kL\",1000,1)*OFFSET(Admin!$AR$3,MATCH(\"GJ\",convSources,0),MATCH(K31,convTargets,0)),IF(OR(N31=\"Kg\",N31=\"Tonnes\"),VLOOKUP(\"F2-\"&Q31,Admin!BN:BT,6,FALSE)*IF(N31=\"Tonnes\",1000,1)*OFFSET(Admin!$AR$3,MATCH(\"GJ\",convSources,0),MATCH(K31,convTargets,0)),IF(N31=\"m3\",VLOOKUP(\"F2-\"&Q31,Admin!BN:BT,7,FALSE)*OFFSET(Admin!$AR$3,MATCH(\"GJ\",convSources,0),MATCH(K31,convTargets,0)),OFFSET(Admin!$AR$3,MATCH(N31,convSources,0),MATCH(K31,convTargets,0))))))","v":0},"MJ","Manual",null,"Tonnes",{"$f":"IF(OR(L31=\"Segment Aggregation\",L31=\"Auto-Calc\"),\"NA\",IF(AND(I31=\"Mandatory\",OR(M31=\"\",N31=\"\")), \"FAIL\", IF(I31=\"Optional\",\"NA\",\"PASS\")))","v":"NA"},null,"Coal Briquettes"]
["F1","F1.2","F1","Machinery (any item of plant or equipment that uses fuel for a defined process that is not already counted in T1)",{"$f":"IFERROR(LEN(B32)-LEN(SUBSTITUTE(B32,\".\",\"\") ),\"BAD VALUE\")","v":1},null,null,"Machinery (any item of plant or equipment that uses fuel for a defined process that is not already counted in T1)","Optional",{"$f":"IF(N32=\"NA\",_xlfn.VALUETOTEXT(M32),M32*IF(OR(N32=\"L\", N32=\"kL\"),VLOOKUP(\"F2-\"&Q32,Admin!BN:BT,5,FALSE)*IF(N32=\"kL\",1000,1)*OFFSET(Admin!$AR$3,MATCH(\"GJ\",convSources,0),MATCH(K32,convTargets,0)),IF(OR(N32=\"Kg\",N32=\"Tonnes\"),VLOOKUP(\"F2-\"&Q32,Admin!BN:BT,6,FALSE)*IF(N32=\"Tonnes\",1000,1)*OFFSET(Admin!$AR$3,MATCH(\"GJ\",convSources,0),MATCH(K32,convTargets,0)),IF(N32=\"m3\",VLOOKUP(\"F2-\"&Q32,Admin!BN:BT,7,FALSE)*OFFSET(Admin!$AR$3,MATCH(\"GJ\",convSources,0),MATCH(K32,convTargets,0)),OFFSET(Admin!$AR$3,MATCH(N32,convSources,0),MATCH(K32,convTargets,0))))))","v":0},"MJ","Segment Aggregation",{"$f":"SUMIF(C:C,B32,J:J)","v":0},"MJ","NA",null,"Machinery (any item of plant or equipment that uses fuel for a defined process that is not already counted in T1)"]
["F1","F1.2.1","F1.2","Machinery (any item of plant or equipment that uses fuel for a defined process that is not already counted in T1)FRDSegmentSplitNatural gas",{"$f":"IFERROR(LEN(B33)-LEN(SUBSTITUTE(B33,\".\",\"\") ),\"BAD VALUE\")","v":2},"+ (add segment)",null,"Natural gas","Optional",{"$f":"IF(N33=\"NA\",_xlfn.VALUETOTEXT(M33),M33*IF(OR(N33=\"L\", N33=\"kL\"),VLOOKUP(\"F2-\"&Q33,Admin!BN:BT,5,FALSE)*IF(N33=\"kL\",1000,1)*OFFSET(Admin!$AR$3,MATCH(\"GJ\",convSources,0),MATCH(K33,convTargets,0)),IF(OR(N33=\"Kg\",N33=\"Tonnes\"),VLOOKUP(\"F2-\"&Q33,Admin!BN:BT,6,FALSE)*IF(N33=\"Tonnes\",1000,1)*OFFSET(Admin!$AR$3,MATCH(\"GJ\",convSources,0),MATCH(K33,convTargets,0)),IF(N33=\"m3\",VLOOKUP(\"F2-\"&Q33,Admin!BN:BT,7,FALSE)*OFFSET(Admin!$AR$3,MATCH(\"GJ\",convSources,0),MATCH(K33,convTargets,0)),OFFSET(Admin!$AR$3,MATCH(N33,convSources,0),MATCH(K33,convTargets,0))))))","v":0},"MJ","Manual",null,"MWh","NA",null,"Natural gas"]
["F1","F1.2.2","F1.2","Machinery (any item of plant or equipment that uses fuel for a defined process that is not already counted in T1)FRDSegmentSplitLPG",{"$f":"IFERROR(LEN(B34)-LEN(SUBSTITUTE(B34,\".\",\"\") ),\"BAD VALUE\")","v":2},"+ (add segment)",null,"LPG","Optional",{"$f":"IF(N34=\"NA\",_xlfn.VALUETOTEXT(M34),M34*IF(OR(N34=\"L\", N34=\"kL\"),VLOOKUP(\"F2-\"&Q34,Admin!BN:BT,5,FALSE)*IF(N34=\"kL\",1000,1)*OFFSET(Admin!$AR$3,MATCH(\"GJ\",convSources,0),MATCH(K34,convTargets,0)),IF(OR(N34=\"Kg\",N34=\"Tonnes\"),VLOOKUP(\"F2-\"&Q34,Admin!BN:BT,6,FALSE)*IF(N34=\"Tonnes\",1000,1)*OFFSET(Admin!$AR$3,MATCH(\"GJ\",convSources,0),MATCH(K34,convTargets,0)),IF(N34=\"m3\",VLOOKUP(\"F2-\"&Q34,Admin!BN:BT,7,FALSE)*OFFSET(Admin!$AR$3,MATCH(\"GJ\",convSources,0),MATCH(K34,convTargets,0)),OFFSET(Admin!$AR$3,MATCH(N34,convSources,0),MATCH(K34,convTargets,0))))))","v":0},"MJ","Manual",null,"MJ","NA",null,"LPG"]
["F1","F1.2.3","F1.2","Machinery (any item of plant or equipment that uses fuel for a defined process that is not already counted in T1)FRDSegmentSplitDiesel",2,"+ (add segment)",null,"Diesel","Optional",{"$f":"IF(N35=\"NA\",_xlfn.VALUETOTEXT(M35),M35*IF(OR(N35=\"L\", N35=\"kL\"),VLOOKUP(\"F2-\"&Q35,Admin!BN:BT,5,FALSE)*IF(N35=\"kL\",1000,1)*OFFSET(Admin!$AR$3,MATCH(\"GJ\",convSources,0),MATCH(K35,convTargets,0)),IF(OR(N35=\"Kg\",N35=\"Tonnes\"),VLOOKUP(\"F2-\"&Q35,Admin!BN:BT,6,FALSE)*IF(N35=\"Tonnes\",1000,1)*OFFSET(Admin!$AR$3,MATCH(\"GJ\",convSources,0),MATCH(K35,convTargets,0)),IF(N35=\"m3\",VLOOKUP(\"F2-\"&Q35,Admin!BN:BT,7,FALSE)*OFFSET(Admin!$AR$3,MATCH(\"GJ\",convSources,0),MATCH(K35,convTargets,0)),OFFSET(Admin!$AR$3,MATCH(N35,convSources,0),MATCH(K35,convTargets,0))))))","v":0},"MJ","Manual",null,"MJ","NA",null,"Diesel"]
["F1","F1.2.4","F1.2","Machinery (any item of plant or equipment that uses fuel for a defined process that is not already counted in T1)FRDSegmentSplitPetrol",{"$f":"IFERROR(LEN(B36)-LEN(SUBSTITUTE(B36,\".\",\"\") ),\"BAD VALUE\")","v":2},"+ (add segment)",null,"Petrol","Optional",{"$f":"IF(N36=\"NA\",_xlfn.VALUETOTEXT(M36),M36*IF(OR(N36=\"L\", N36=\"kL\"),VLOOKUP(\"F2-\"&Q36,Admin!BN:BT,5,FALSE)*IF(N36=\"kL\",1000,1)*OFFSET(Admin!$AR$3,MATCH(\"GJ\",convSources,0),MATCH(K36,convTargets,0)),IF(OR(N36=\"Kg\",N36=\"Tonnes\"),VLOOKUP(\"F2-\"&Q36,Admin!BN:BT,6,FALSE)*IF(N36=\"Tonnes\",1000,1)*OFFSET(Admin!$AR$3,MATCH(\"GJ\",convSources,0),MATCH(K36,convTargets,0)),IF(N36=\"m3\",VLOOKUP(\"F2-\"&Q36,Admin!BN:BT,7,FALSE)*OFFSET(Admin!$AR$3,MATCH(\"GJ\",convSources,0),MATCH(K36,convTargets,0)),OFFSET(Admin!$AR$3,MATCH(N36,convSources,0),MATCH(K36,convTargets,0))))))","v":0},"MJ","Manual",null,"MJ","NA",null,"Petrol"]
["F1","F1.2.5","F1.2","Machinery (any item of plant or equipment that uses fuel for a defined process that is not already counted in T1)FRDSegmentSplitHydrogen",{"$f":"IFERROR(LEN(B37)-LEN(SUBSTITUTE(B37,\".\",\"\") ),\"BAD VALUE\")","v":2},"+ (add segment)",null,"Hydrogen","Optional",{"$f":"IF(N37=\"NA\",_xlfn.VALUETOTEXT(M37),M37*IF(OR(N37=\"L\", N37=\"kL\"),VLOOKUP(\"F2-\"&Q37,Admin!BN:BT,5,FALSE)*IF(N37=\"kL\",1000,1)*OFFSET(Admin!$AR$3,MATCH(\"MJ\",convSources,0),MATCH(K37,convTargets,0)),IF(OR(N37=\"Kg\",N37=\"Tonnes\"),VLOOKUP(\"F2-\"&Q37,Admin!BN:BT,6,FALSE)*IF(N37=\"Tonnes\",1000,1)*OFFSET(Admin!$AR$3,MATCH(\"MJ\",convSources,0),MATCH(K37,convTargets,0)),IF(N37=\"m3\",VLOOKUP(\"F2-\"&Q37,Admin!BN:BT,7,FALSE)*OFFSET(Admin!$AR$3,MATCH(\"MJ\",convSources,0),MATCH(K37,convTargets,0)),OFFSET(Admin!$AR$3,MATCH(N37,convSources,0),MATCH(K37,convTargets,0))))))","v":0},"MJ","Manual",null,"Kg","NA",null,"Hydrogen"]
["F1","F1.2.6","F1.2","Machinery (any item of plant or equipment that uses fuel for a defined process that is not already counted in T1)FRDSegmentSplitFuel Oil",{"$f":"IFERROR(LEN(B38)-LEN(SUBSTITUTE(B38,\".\",\"\") ),\"BAD VALUE\")","v":2},"+ (add segment)",null,"Fuel Oil",{"$f":"IF(VLOOKUP(A38,TierIndicators,3,FALSE)=\"Yes\", \"Mandatory\", \"Optional\")","v":"Optional"},{"$f":"IF(N38=\"NA\",_xlfn.VALUETOTEXT(M38),M38*IF(OR(N38=\"L\", N38=\"kL\"),VLOOKUP(\"F2-\"&Q38,Admin!BN:BT,5,FALSE)*IF(N38=\"kL\",1000,1)*OFFSET(Admin!$AR$3,MATCH(\"GJ\",convSources,0),MATCH(K38,convTargets,0)),IF(OR(N38=\"Kg\",N38=\"Tonnes\"),VLOOKUP(\"F2-\"&Q38,Admin!BN:BT,6,FALSE)*IF(N38=\"Tonnes\",1000,1)*OFFSET(Admin!$AR$3,MATCH(\"GJ\",convSources,0),MATCH(K38,convTargets,0)),IF(N38=\"m3\",VLOOKUP(\"F2-\"&Q38,Admin!BN:BT,7,FALSE)*OFFSET(Admin!$AR$3,MATCH(\"GJ\",convSources,0),MATCH(K38,convTargets,0)),OFFSET(Admin!$AR$3,MATCH(N38,convSources,0),MATCH(K38,convTargets,0))))))","v":0},"MJ","Manual",null,"MJ",{"$f":"IF(OR(L38=\"Segment Aggregation\",L38=\"Auto-Calc\"),\"NA\",IF(AND(I38=\"Mandatory\",OR(M38=\"\",N38=\"\")), \"FAIL\", IF(I38=\"Optional\",\"NA\",\"PASS\")))","v":"NA"},null,"Fuel Oil"]
["F1","F1.2.7","F1.2","Machinery (any item of plant or equipment that uses fuel for a defined process that is not already counted in T1)FRDSegmentSplitSolid Fuel",2,null,null,"Solid Fuel","Optional",{"$f":"IF(N39=\"NA\",_xlfn.VALUETOTEXT(M39),M39*IF(OR(N39=\"L\", N39=\"kL\"),VLOOKUP(\"F2-\"&Q39,Admin!BN:BT,5,FALSE)*IF(N39=\"kL\",1000,1)*OFFSET(Admin!$AR$3,MATCH(\"GJ\",convSources,0),MATCH(K39,convTargets,0)),IF(OR(N39=\"Kg\",N39=\"Tonnes\"),VLOOKUP(\"F2-\"&Q39,Admin!BN:BT,6,FALSE)*IF(N39=\"Tonnes\",1000,1)*OFFSET(Admin!$AR$3,MATCH(\"GJ\",convSources,0),MATCH(K39,convTargets,0)),IF(N39=\"m3\",VLOOKUP(\"F2-\"&Q39,Admin!BN:BT,7,FALSE)*OFFSET(Admin!$AR$3,MATCH(\"GJ\",convSources,0),MATCH(K39,convTargets,0)),OFFSET(Admin!$AR$3,MATCH(N39,convSources,0),MATCH(K39,convTargets,0))))))","v":0},"MJ","Segment Aggregation",{"$f":"SUMIF(C:C,B39,J:J)","v":0},"MJ","NA",null,"Solid Fuel"]
["F1","F1.2..1","F1.2.7","Machinery (any item of plant or equipment that uses fuel for a defined process that is not already counted in T1)FRDSegmentSplitSolid FuelFRDSegmentSplitDry wood",3,"+ (add segment)",null,"Dry wood","Optional",{"$f":"IF(N40=\"NA\",_xlfn.VALUETOTEXT(M40),M40*IF(OR(N40=\"L\", N40=\"kL\"),VLOOKUP(\"F2-\"&Q40,Admin!BN:BT,5,FALSE)*IF(N40=\"kL\",1000,1)*OFFSET(Admin!$AR$3,MATCH(\"GJ\",convSources,0),MATCH(K40,convTargets,0)),IF(OR(N40=\"Kg\",N40=\"Tonnes\"),VLOOKUP(\"F2-\"&Q40,Admin!BN:BT,6,FALSE)*IF(N40=\"Tonnes\",1000,1)*OFFSET(Admin!$AR$3,MATCH(\"GJ\",convSources,0),MATCH(K40,convTargets,0)),IF(N40=\"m3\",VLOOKUP(\"F2-\"&Q40,Admin!BN:BT,7,FALSE)*OFFSET(Admin!$AR$3,MATCH(\"GJ\",convSources,0),MATCH(K40,convTargets,0)),OFFSET(Admin!$AR$3,MATCH(N40,convSources,0),MATCH(K40,convTargets,0))))))","v":0},"MJ","Manual",null,"Tonnes","NA",null,"Dry wood"]
["F1","F1.2.7.2","F1.2.7","Machinery (any item of plant or equipment that uses fuel for a defined process that is not already counted in T1)FRDSegmentSplitSolid FuelFRDSegmentSplitGreen and air dried wood",3,"+ (add segment)",null,"Green and air dried wood","Optional",{"$f":"IF(N41=\"NA\",_xlfn.VALUETOTEXT(M41),M41*IF(OR(N41=\"L\", N41=\"kL\"),VLOOKUP(\"F2-\"&Q41,Admin!BN:BT,5,FALSE)*IF(N41=\"kL\",1000,1)*OFFSET(Admin!$AR$3,MATCH(\"GJ\",convSources,0),MATCH(K41,convTargets,0)),IF(OR(N41=\"Kg\",N41=\"Tonnes\"),VLOOKUP(\"F2-\"&Q41,Admin!BN:BT,6,FALSE)*IF(N41=\"Tonnes\",1000,1)*OFFSET(Admin!$AR$3,MATCH(\"GJ\",convSources,0),MATCH(K41,convTargets,0)),IF(N41=\"m3\",VLOOKUP(\"F2-\"&Q41,Admin!BN:BT,7,FALSE)*OFFSET(Admin!$AR$3,MATCH(\"GJ\",convSources,0),MATCH(K41,convTargets,0)),OFFSET(Admin!$AR$3,MATCH(N41,convSources,0),MATCH(K41,convTargets,0))))))","v":0},"MJ","Manual",null,"MJ","NA",null,"Green and air dried wood"]
["F1","F1.2.7.3","F1.2.7","Machinery (any item of plant or equipment that uses fuel for a defined process that is not already counted in T1)FRDSegmentSplitSolid FuelFRDSegmentSplitBagasse",3,"+ (add segment)",null,"Bagasse","Optional",{"$f":"IF(N42=\"NA\",_xlfn.VALUETOTEXT(M42),M42*IF(OR(N42=\"L\", N42=\"kL\"),VLOOKUP(\"F2-\"&Q42,Admin!BN:BT,5,FALSE)*IF(N42=\"kL\",1000,1)*OFFSET(Admin!$AR$3,MATCH(\"GJ\",convSources,0),MATCH(K42,convTargets,0)),IF(OR(N42=\"Kg\",N42=\"Tonnes\"),VLOOKUP(\"F2-\"&Q42,Admin!BN:BT,6,FALSE)*IF(N42=\"Tonnes\",1000,1)*OFFSET(Admin!$AR$3,MATCH(\"GJ\",convSources,0),MATCH(K42,convTargets,0)),IF(N42=\"m3\",VLOOKUP(\"F2-\"&Q42,Admin!BN:BT,7,FALSE)*OFFSET(Admin!$AR$3,MATCH(\"GJ\",convSources,0),MATCH(K42,convTargets,0)),OFFSET(Admin!$AR$3,MATCH(N42,convSources,0),MATCH(K42,convTargets,0))))))","v":0},"MJ","Manual",null,"Tonnes","NA",null,"Bagasse"]
["F1","F1.2.7.4","F1.2.7","Machinery (any item of plant or equipment that uses fuel for a defined process that is not already counted in T1)FRDSegmentSplitSolid FuelFRDSegmentSplitBiomass municipal and other industrial materials",3,"+ (add segment)",null,"Biomass municipal and other industrial materials","Optional",{"$f":"IF(N43=\"NA\",_xlfn.VALUETOTEXT(M43),M43*IF(OR(N43=\"L\", N43=\"kL\"),VLOOKUP(\"F2-\"&Q43,Admin!BN:BT,5,FALSE)*IF(N43=\"kL\",1000,1)*OFFSET(Admin!$AR$3,MATCH(\"GJ\",convSources,0),MATCH(K43,convTargets,0)),IF(OR(N43=\"Kg\",N43=\"Tonnes\"),VLOOKUP(\"F2-\"&Q43,Admin!BN:BT,6,FALSE)*IF(N43=\"Tonnes\",1000,1)*OFFSET(Admin!$AR$3,MATCH(\"GJ\",convSources,0),MATCH(K43,convTargets,0)),IF(N43=\"m3\",VLOOKUP(\"F2-\"&Q43,Admin!BN:BT,7,FALSE)*OFFSET(Admin!$AR$3,MATCH(\"GJ\",convSources,0),MATCH(K43,convTargets,0)),OFFSET(Admin!$AR$3,MATCH(N43,convSources,0),MATCH(K43,convTargets,0))))))","v":0},"MJ","Manual",null,"Tonnes","NA",null,"Biomass municipal and other industrial materials"]
["F1","F1.2.7.5","F1.2.7","Machinery (any item of plant or equipment that uses fuel for a defined process that is not already counted in T1)FRDSegmentSplitSolid FuelFRDSegmentSplitCharcoal",3,"+ (add segment)",null,"Charcoal","Optional",{"$f":"IF(N44=\"NA\",_xlfn.VALUETOTEXT(M44),M44*IF(OR(N44=\"L\", N44=\"kL\"),VLOOKUP(\"F2-\"&Q44,Admin!BN:BT,5,FALSE)*IF(N44=\"kL\",1000,1)*OFFSET(Admin!$AR$3,MATCH(\"GJ\",convSources,0),MATCH(K44,convTargets,0)),IF(OR(N44=\"Kg\",N44=\"Tonnes\"),VLOOKUP(\"F2-\"&Q44,Admin!BN:BT,6,FALSE)*IF(N44=\"Tonnes\",1000,1)*OFFSET(Admin!$AR$3,MATCH(\"GJ\",convSources,0),MATCH(K44,convTargets,0)),IF(N44=\"m3\",VLOOKUP(\"F2-\"&Q44,Admin!BN:BT,7,FALSE)*OFFSET(Admin!$AR$3,MATCH(\"GJ\",convSources,0),MATCH(K44,convTargets,0)),OFFSET(Admin!$AR$3,MATCH(N44,convSources,0),MATCH(K44,convTargets,0))))))","v":0},"MJ","Manual",null,"Tonnes","NA",null,"Charcoal"]
["F1","F1.2.7.6","F1.2.7","Machinery (any item of plant or equipment that uses fuel for a defined process that is not already counted in T1)FRDSegmentSplitSolid FuelFRDSegmentSplitAnthracite coal",{"$f":"IFERROR(LEN(B45)-LEN(SUBSTITUTE(B45,\".\",\"\") ),\"BAD VALUE\")","v":3},"+ (add segment)",null,"Anthracite coal",{"$f":"IF(VLOOKUP(A45,TierIndicators,3,FALSE)=\"Yes\", \"Mandatory\", \"Optional\")","v":"Optional"},{"$f":"IF(N45=\"NA\",_xlfn.VALUETOTEXT(M45),M45*IF(OR(N45=\"L\", N45=\"kL\"),VLOOKUP(\"F2-\"&Q45,Admin!BN:BT,5,FALSE)*IF(N45=\"kL\",1000,1)*OFFSET(Admin!$AR$3,MATCH(\"GJ\",convSources,0),MATCH(K45,convTargets,0)),IF(OR(N45=\"Kg\",N45=\"Tonnes\"),VLOOKUP(\"F2-\"&Q45,Admin!BN:BT,6,FALSE)*IF(N45=\"Tonnes\",1000,1)*OFFSET(Admin!$AR$3,MATCH(\"GJ\",convSources,0),MATCH(K45,convTargets,0)),IF(N45=\"m3\",VLOOKUP(\"F2-\"&Q45,Admin!BN:BT,7,FALSE)*OFFSET(Admin!$AR$3,MATCH(\"GJ\",convSources,0),MATCH(K45,convTargets,0)),OFFSET(Admin!$AR$3,MATCH(N45,convSources,0),MATCH(K45,convTargets,0))))))","v":0},"MJ","Manual",null,"Tonnes",{"$f":"IF(OR(L45=\"Segment Aggregation\",L45=\"Auto-Calc\"),\"NA\",IF(AND(I45=\"Mandatory\",OR(M45=\"\",N45=\"\")), \"FAIL\", IF(I45=\"Optional\",\"NA\",\"PASS\")))","v":"NA"},null,"Anthracite coal"]
["F1","F1.2.7.7","F1.2.7","Machinery (any item of plant or equipment that uses fuel for a defined process that is not already counted in T1)FRDSegmentSplitSolid FuelFRDSegmentSplitBituminous coal",{"$f":"IFERROR(LEN(B46)-LEN(SUBSTITUTE(B46,\".\",\"\") ),\"BAD VALUE\")","v":3},"+ (add segment)",null,"Bituminous coal",{"$f":"IF(VLOOKUP(A46,TierIndicators,3,FALSE)=\"Yes\", \"Mandatory\", \"Optional\")","v":"Optional"},{"$f":"IF(N46=\"NA\",_xlfn.VALUETOTEXT(M46),M46*IF(OR(N46=\"L\", N46=\"kL\"),VLOOKUP(\"F2-\"&Q46,Admin!BN:BT,5,FALSE)*IF(N46=\"kL\",1000,1)*OFFSET(Admin!$AR$3,MATCH(\"GJ\",convSources,0),MATCH(K46,convTargets,0)),IF(OR(N46=\"Kg\",N46=\"Tonnes\"),VLOOKUP(\"F2-\"&Q46,Admin!BN:BT,6,FALSE)*IF(N46=\"Tonnes\",1000,1)*OFFSET(Admin!$AR$3,MATCH(\"GJ\",convSources,0),MATCH(K46,convTargets,0)),IF(N46=\"m3\",VLOOKUP(\"F2-\"&Q46,Admin!BN:BT,7,FALSE)*OFFSET(Admin!$AR$3,MATCH(\"GJ\",convSources,0),MATCH(K46,convTargets,0)),OFFSET(Admin!$AR$3,MATCH(N46,convSources,0),MATCH(K46,convTargets,0))))))","v":0},"MJ","Manual",null,"Tonnes",{"$f":"IF(OR(L46=\"Segment Aggregation\",L46=\"Auto-Calc\"),\"NA\",IF(AND(I46=\"Mandatory\",OR(M46=\"\",N46=\"\")), \"FAIL\", IF(I46=\"Optional\",\"NA\",\"PASS\")))","v":"NA"},null,"Bituminous coal"]
["F1","F1.2.7.8","F1.2.7","Machinery (any item of plant or equipment that uses fuel for a defined process that is not already counted in T1)FRDSegmentSplitSolid FuelFRDSegmentSplitCoal Briquettes",{"$f":"IFERROR(LEN(B47)-LEN(SUBSTITUTE(B47,\".\",\"\") ),\"BAD VALUE\")","v":3},"+ (add segment)",null,"Coal Briquettes",{"$f":"IF(VLOOKUP(A47,TierIndicators,3,FALSE)=\"Yes\", \"Mandatory\", \"Optional\")","v":"Optional"},{"$f":"IF(N47=\"NA\",_xlfn.VALUETOTEXT(M47),M47*IF(OR(N47=\"L\", N47=\"kL\"),VLOOKUP(\"F2-\"&Q47,Admin!BN:BT,5,FALSE)*IF(N47=\"kL\",1000,1)*OFFSET(Admin!$AR$3,MATCH(\"GJ\",convSources,0),MATCH(K47,convTargets,0)),IF(OR(N47=\"Kg\",N47=\"Tonnes\"),VLOOKUP(\"F2-\"&Q47,Admin!BN:BT,6,FALSE)*IF(N47=\"Tonnes\",1000,1)*OFFSET(Admin!$AR$3,MATCH(\"GJ\",convSources,0),MATCH(K47,convTargets,0)),IF(N47=\"m3\",VLOOKUP(\"F2-\"&Q47,Admin!BN:BT,7,FALSE)*OFFSET(Admin!$AR$3,MATCH(\"GJ\",convSources,0),MATCH(K47,convTargets,0)),OFFSET(Admin!$AR$3,MATCH(N47,convSources,0),MATCH(K47,convTargets,0))))))","v":0},"MJ","Manual",null,"Tonnes",{"$f":"IF(OR(L47=\"Segment Aggregation\",L47=\"Auto-Calc\"),\"NA\",IF(AND(I47=\"Mandatory\",OR(M47=\"\",N47=\"\")), \"FAIL\", IF(I47=\"Optional\",\"NA\",\"PASS\")))","v":"NA"},null,"Coal Briquettes"]
[]
[null,"F2","Greenhouse gas emissions from stationary fuel consumption segmented by fuel type (Tonnes CO2-e)"]
[null,"ID","Parent ID","FRDSegment","Segment Level",null,null,"Description","Flag","Final Value","Final Unit","Input Type","Input Value","Input Unit","CHECK"]
["F2","F2","NA",{"$f":"IF(E51=1,H51,IFERROR(VLOOKUP(C51,$B$14:$D$1048576,3,FALSE)&\"FRDSegmentSplit\"&H51,H51))","v":"Grand Total"},{"$f":"IFERROR(LEN(B51)-LEN(SUBSTITUTE(B51,\".\",\"\") ),\"BAD VALUE\")","v":0},null,null,"Grand Total",{"$f":"IF(VLOOKUP(A51,TierIndicators,3,FALSE)=\"Yes\", \"Mandatory\", \"Optional\")","v":"Optional"},{"$f":"IF(N51=\"NA\",_xlfn.VALUETOTEXT(M51),M51*IF(OR(N51=\"L\", N51=\"kL\"),VLOOKUP(\"F2-\"&Q51,Admin!BN:BT,5,FALSE)*IF(N51=\"kL\",1000,1)*OFFSET(Admin!$AR$3,MATCH(\"MJ\",convSources,0),MATCH(K51,convTargets,0)),IF(N51=\"Kg\",VLOOKUP(\"F2-\"&Q51,Admin!BN:BT,6,FALSE)*OFFSET(Admin!$AR$3,MATCH(\"MJ\",convSources,0),MATCH(K51,convTargets,0)),IF(N51=\"m3\",VLOOKUP(\"F2-\"&Q51,Admin!BN:BT,7,FALSE)*OFFSET(Admin!$AR$3,MATCH(\"Kg\",convSources,0),MATCH(K51,convTargets,0)),OFFSET(Admin!$AR$3,MATCH(N51,convSources,0),MATCH(K51,convTargets,0))))))","v":0},"Tonnes CO2-e","Segment Aggregation",{"$f":"SUMIF(C:C,B51,J:J)","v":0},"Tonnes CO2-e",{"$f":"IF(OR(L51=\"Segment Aggregation\",L51=\"Auto-Calc\"),\"NA\",IF(AND(I51=\"Mandatory\",OR(M51=\"\",N51=\"\")), \"FAIL\", IF(I51=\"Optional\",\"NA\",\"PASS\")))","v":"NA"},null,"Grand Total\n",{"$f":"SUM(R52:R66)","v":0},{"$f":"SUM(S52:S66)","v":0},{"$f":"SUM(T52:T66)","v":0}]
["F2","F2.1","F2","Natural gas",{"$f":"IFERROR(LEN(B52)-LEN(SUBSTITUTE(B52,\".\",\"\") ),\"BAD VALUE\")","v":1},null,null,"Natural gas","Optional",{"$f":"IF(N52=\"NA\",_xlfn.VALUETOTEXT(M52),M52*IF(OR(N52=\"L\", N52=\"kL\"),VLOOKUP(\"F2-\"&Q52,Admin!BN:BT,5,FALSE)*IF(N52=\"kL\",1000,1)*OFFSET(Admin!$AR$3,MATCH(\"MJ\",convSources,0),MATCH(K52,convTargets,0)),IF(N52=\"Kg\",VLOOKUP(\"F2-\"&Q52,Admin!BN:BT,6,FALSE)*OFFSET(Admin!$AR$3,MATCH(\"MJ\",convSources,0),MATCH(K52,convTargets,0)),IF(N52=\"m3\",VLOOKUP(\"F2-\"&Q52,Admin!BN:BT,7,FALSE)*OFFSET(Admin!$AR$3,MATCH(\"Kg\",convSources,0),MATCH(K52,convTargets,0)),OFFSET(Admin!$AR$3,MATCH(N52,convSources,0),MATCH(K52,convTargets,0))))))","v":0},"Tonnes CO2-e","Auto-Calc",{"$f":"(J17 * OFFSET(Admin!$AR$3,MATCH(K17,convSources,0),MATCH(\"GJ\",convTargets,0)) )  *  IFERROR( VLOOKUP(A52 & \"-\" & H52,Admin!BN:BQ,4,FALSE),0)\n+ (J33 * OFFSET(Admin!$AR$3,MATCH(K33,convSources,0),MATCH(\"GJ\",convTargets,0)) )  *  IFERROR( VLOOKUP(A52 & \"-\" & H52,Admin!BN:BQ,4,FALSE),0)","v":0},"Tonnes CO2-e","NA",null,"Natural gas",{"$f":"(J17 * OFFSET(Admin!$AR$3,MATCH(K17,convSources,0),MATCH(\"GJ\",convTargets,0)) )  *  IFERROR( VLOOKUP(A52 & \"-\" & H52,Admin!BN:CC,14,FALSE),0)\n+ (J33 * OFFSET(Admin!$AR$3,MATCH(K33,convSources,0),MATCH(\"GJ\",convTargets,0)) )  *  IFERROR( VLOOKUP(A52 & \"-\" & H52,Admin!BN:CC,14,FALSE),0)","v":0},{"$f":"(J17 * OFFSET(Admin!$AR$3,MATCH(K17,convSources,0),MATCH(\"GJ\",convTargets,0)) )  *  IFERROR( VLOOKUP(A52 & \"-\" & H52,Admin!BN:CC,15,FALSE),0)\n+ (J33 * OFFSET(Admin!$AR$3,MATCH(K33,convSources,0),MATCH(\"GJ\",convTargets,0)) )  *  IFERROR( VLOOKUP(A52 & \"-\" & H52,Admin!BN:CC,15,FALSE),0)","v":0},{"$f":"(J17 * OFFSET(Admin!$AR$3,MATCH(K17,convSources,0),MATCH(\"GJ\",convTargets,0)) )  *  IFERROR( VLOOKUP(A52 & \"-\" & H52,Admin!BN:CC,16,FALSE),0)\n+ (J33 * OFFSET(Admin!$AR$3,MATCH(K33,convSources,0),MATCH(\"GJ\",convTargets,0)) )  *  IFERROR( VLOOKUP(A52 & \"-\" & H52,Admin!BN:CC,16,FALSE),0)","v":0}]
["F2","F2.2","F2","LPG",{"$f":"IFERROR(LEN(B53)-LEN(SUBSTITUTE(B53,\".\",\"\") ),\"BAD VALUE\")","v":1},null,null,"LPG","Optional",{"$f":"IF(N53=\"NA\",_xlfn.VALUETOTEXT(M53),M53*IF(OR(N53=\"L\", N53=\"kL\"),VLOOKUP(\"F2-\"&Q53,Admin!BN:BT,5,FALSE)*IF(N53=\"kL\",1000,1)*OFFSET(Admin!$AR$3,MATCH(\"MJ\",convSources,0),MATCH(K53,convTargets,0)),IF(N53=\"Kg\",VLOOKUP(\"F2-\"&Q53,Admin!BN:BT,6,FALSE)*OFFSET(Admin!$AR$3,MATCH(\"MJ\",convSources,0),MATCH(K53,convTargets,0)),IF(N53=\"m3\",VLOOKUP(\"F2-\"&Q53,Admin!BN:BT,7,FALSE)*OFFSET(Admin!$AR$3,MATCH(\"Kg\",convSources,0),MATCH(K53,convTargets,0)),OFFSET(Admin!$AR$3,MATCH(N53,convSources,0),MATCH(K53,convTargets,0))))))","v":0},"Tonnes CO2-e","Auto-Calc",{"$f":"(J18 * OFFSET(Admin!$AR$3,MATCH(K18,convSources,0),MATCH(\"GJ\",convTargets,0)) )  *  IFERROR( VLOOKUP(A53 & \"-\" & H53,Admin!BN:BQ,4,FALSE),0)\n+ (J34 * OFFSET(Admin!$AR$3,MATCH(K34,convSources,0),MATCH(\"GJ\",convTargets,0)) )  *  IFERROR( VLOOKUP(A53 & \"-\" & H53,Admin!BN:BQ,4,FALSE),0)","v":0},"Tonnes CO2-e","NA",null,"LPG",{"$f":"(J18 * OFFSET(Admin!$AR$3,MATCH(K18,convSources,0),MATCH(\"GJ\",convTargets,0)) )  *  IFERROR( VLOOKUP(A53 & \"-\" & H53,Admin!BN:CC,14,FALSE),0)\n+ (J34 * OFFSET(Admin!$AR$3,MATCH(K34,convSources,0),MATCH(\"GJ\",convTargets,0)) )  *  IFERROR( VLOOKUP(A53 & \"-\" & H53,Admin!BN:CC,14,FALSE),0)","v":0},{"$f":"(J18 * OFFSET(Admin!$AR$3,MATCH(K18,convSources,0),MATCH(\"GJ\",convTargets,0)) )  *  IFERROR( VLOOKUP(A53 & \"-\" & H53,Admin!BN:CC,15,FALSE),0)\n+ (J34 * OFFSET(Admin!$AR$3,MATCH(K34,convSources,0),MATCH(\"GJ\",convTargets,0)) )  *  IFERROR( VLOOKUP(A53 & \"-\" & H53,Admin!BN:CC,15,FALSE),0)","v":0},{"$f":"(J18 * OFFSET(Admin!$AR$3,MATCH(K18,convSources,0),MATCH(\"GJ\",convTargets,0)) )  *  IFERROR( VLOOKUP(A53 & \"-\" & H53,Admin!BN:CC,16,FALSE),0)\n+ (J34 * OFFSET(Admin!$AR$3,MATCH(K34,convSources,0),MATCH(\"GJ\",convTargets,0)) )  *  IFERROR( VLOOKUP(A53 & \"-\" & H53,Admin!BN:CC,16,FALSE),0)","v":0}]
["F2","F2.3","F2","Diesel",1,null,null,"Diesel","Optional",{"$f":"IF(N54=\"NA\",_xlfn.VALUETOTEXT(M54),M54*IF(OR(N54=\"L\", N54=\"kL\"),VLOOKUP(\"F2-\"&Q54,Admin!BN:BT,5,FALSE)*IF(N54=\"kL\",1000,1)*OFFSET(Admin!$AR$3,MATCH(\"MJ\",convSources,0),MATCH(K54,convTargets,0)),IF(N54=\"Kg\",VLOOKUP(\"F2-\"&Q54,Admin!BN:BT,6,FALSE)*OFFSET(Admin!$AR$3,MATCH(\"MJ\",convSources,0),MATCH(K54,convTargets,0)),IF(N54=\"m3\",VLOOKUP(\"F2-\"&Q54,Admin!BN:BT,7,FALSE)*OFFSET(Admin!$AR$3,MATCH(\"Kg\",convSources,0),MATCH(K54,convTargets,0)),OFFSET(Admin!$AR$3,MATCH(N54,convSources,0),MATCH(K54,convTargets,0))))))","v":0},"Tonnes CO2-e","Auto-Calc",{"$f":"(J19 * OFFSET(Admin!$AR$3,MATCH(K19,convSources,0),MATCH(\"GJ\",convTargets,0)) )  *  IFERROR( VLOOKUP(A54 & \"-\" & H54,Admin!BN:BQ,4,FALSE),0)\n+ (J35 * OFFSET(Admin!$AR$3,MATCH(K35,convSources,0),MATCH(\"GJ\",convTargets,0)) )  *  IFERROR( VLOOKUP(A54 & \"-\" & H54,Admin!BN:BQ,4,FALSE),0)","v":0},"Tonnes CO2-e","NA",null,"Diesel",{"$f":"(J19 * OFFSET(Admin!$AR$3,MATCH(K19,convSources,0),MATCH(\"GJ\",convTargets,0)) )  *  IFERROR( VLOOKUP(A54 & \"-\" & H54,Admin!BN:CC,14,FALSE),0)\n+ (J35 * OFFSET(Admin!$AR$3,MATCH(K35,convSources,0),MATCH(\"GJ\",convTargets,0)) )  *  IFERROR( VLOOKUP(A54 & \"-\" & H54,Admin!BN:CC,14,FALSE),0)","v":0},{"$f":"(J19 * OFFSET(Admin!$AR$3,MATCH(K19,convSources,0),MATCH(\"GJ\",convTargets,0)) )  *  IFERROR( VLOOKUP(A54 & \"-\" & H54,Admin!BN:CC,15,FALSE),0)\n+ (J35 * OFFSET(Admin!$AR$3,MATCH(K35,convSources,0),MATCH(\"GJ\",convTargets,0)) )  *  IFERROR( VLOOKUP(A54 & \"-\" & H54,Admin!BN:CC,15,FALSE),0)","v":0},{"$f":"(J19 * OFFSET(Admin!$AR$3,MATCH(K19,convSources,0),MATCH(\"GJ\",convTargets,0)) )  *  IFERROR( VLOOKUP(A54 & \"-\" & H54,Admin!BN:CC,16,FALSE),0)\n+ (J35 * OFFSET(Admin!$AR$3,MATCH(K35,convSources,0),MATCH(\"GJ\",convTargets,0)) )  *  IFERROR( VLOOKUP(A54 & \"-\" & H54,Admin!BN:CC,16,FALSE),0)","v":0}]
["F2","F2.4","F2","Petrol",{"$f":"IFERROR(LEN(B55)-LEN(SUBSTITUTE(B55,\".\",\"\") ),\"BAD VALUE\")","v":1},null,null,"Petrol","Optional",{"$f":"IF(N55=\"NA\",_xlfn.VALUETOTEXT(M55),M55*IF(OR(N55=\"L\", N55=\"kL\"),VLOOKUP(\"F2-\"&Q55,Admin!BN:BT,5,FALSE)*IF(N55=\"kL\",1000,1)*OFFSET(Admin!$AR$3,MATCH(\"MJ\",convSources,0),MATCH(K55,convTargets,0)),IF(N55=\"Kg\",VLOOKUP(\"F2-\"&Q55,Admin!BN:BT,6,FALSE)*OFFSET(Admin!$AR$3,MATCH(\"MJ\",convSources,0),MATCH(K55,convTargets,0)),IF(N55=\"m3\",VLOOKUP(\"F2-\"&Q55,Admin!BN:BT,7,FALSE)*OFFSET(Admin!$AR$3,MATCH(\"Kg\",convSources,0),MATCH(K55,convTargets,0)),OFFSET(Admin!$AR$3,MATCH(N55,convSources,0),MATCH(K55,convTargets,0))))))","v":0},"Tonnes CO2-e","Auto-Calc",{"$f":"(J20 * OFFSET(Admin!$AR$3,MATCH(K20,convSources,0),MATCH(\"GJ\",convTargets,0)) )  *  IFERROR( VLOOKUP(A55 & \"-\" & H55,Admin!BN:BQ,4,FALSE),0)\n+ (J36 * OFFSET(Admin!$AR$3,MATCH(K36,convSources,0),MATCH(\"GJ\",convTargets,0)) )  *  IFERROR( VLOOKUP(A55 & \"-\" & H55,Admin!BN:BQ,4,FALSE),0)","v":0},"Tonnes CO2-e","NA",null,"Petrol",{"$f":"(J20 * OFFSET(Admin!$AR$3,MATCH(K20,convSources,0),MATCH(\"GJ\",convTargets,0)) )  *  IFERROR( VLOOKUP(A55 & \"-\" & H55,Admin!BN:CC,14,FALSE),0)\n+ (J36 * OFFSET(Admin!$AR$3,MATCH(K36,convSources,0),MATCH(\"GJ\",convTargets,0)) )  *  IFERROR( VLOOKUP(A55 & \"-\" & H55,Admin!BN:CC,14,FALSE),0)","v":0},{"$f":"(J20 * OFFSET(Admin!$AR$3,MATCH(K20,convSources,0),MATCH(\"GJ\",convTargets,0)) )  *  IFERROR( VLOOKUP(A55 & \"-\" & H55,Admin!BN:CC,15,FALSE),0)\n+ (J36 * OFFSET(Admin!$AR$3,MATCH(K36,convSources,0),MATCH(\"GJ\",convTargets,0)) )  *  IFERROR( VLOOKUP(A55 & \"-\" & H55,Admin!BN:CC,15,FALSE),0)","v":0},{"$f":"(J20 * OFFSET(Admin!$AR$3,MATCH(K20,convSources,0),MATCH(\"GJ\",convTargets,0)) )  *  IFERROR( VLOOKUP(A55 & \"-\" & H55,Admin!BN:CC,16,FALSE),0)\n+ (J36 * OFFSET(Admin!$AR$3,MATCH(K36,convSources,0),MATCH(\"GJ\",convTargets,0)) )  *  IFERROR( VLOOKUP(A55 & \"-\" & H55,Admin!BN:CC,16,FALSE),0)","v":0}]
["F2","F2.5","F2","Hydrogen",{"$f":"IFERROR(LEN(B56)-LEN(SUBSTITUTE(B56,\".\",\"\") ),\"BAD VALUE\")","v":1},"+ (add segment)",null,"Hydrogen","Optional",{"$f":"IF(N56=\"NA\",_xlfn.VALUETOTEXT(M56),M56*IF(OR(N56=\"L\", N56=\"kL\"),VLOOKUP(\"F2-\"&Q56,Admin!BN:BT,5,FALSE)*IF(N56=\"kL\",1000,1)*OFFSET(Admin!$AR$3,MATCH(\"MJ\",convSources,0),MATCH(K56,convTargets,0)),IF(N56=\"Kg\",VLOOKUP(\"F2-\"&Q56,Admin!BN:BT,6,FALSE)*OFFSET(Admin!$AR$3,MATCH(\"MJ\",convSources,0),MATCH(K56,convTargets,0)),IF(N56=\"m3\",VLOOKUP(\"F2-\"&Q56,Admin!BN:BT,7,FALSE)*OFFSET(Admin!$AR$3,MATCH(\"Kg\",convSources,0),MATCH(K56,convTargets,0)),OFFSET(Admin!$AR$3,MATCH(N56,convSources,0),MATCH(K56,convTargets,0))))))","v":0},"Tonnes CO2-e","Manual",null,"Tonnes CO2-e","NA",null,"Hydrogen"]
["F2","F2.6","F2","Fuel Oil",{"$f":"IFERROR(LEN(B57)-LEN(SUBSTITUTE(B57,\".\",\"\") ),\"BAD VALUE\")","v":1},null,null,"Fuel Oil",{"$f":"IF(VLOOKUP(A57,TierIndicators,3,FALSE)=\"Yes\", \"Mandatory\", \"Optional\")","v":"Optional"},{"$f":"IF(N57=\"NA\",_xlfn.VALUETOTEXT(M57),M57*IF(OR(N57=\"L\", N57=\"kL\"),VLOOKUP(\"F2-\"&Q57,Admin!BN:BT,5,FALSE)*IF(N57=\"kL\",1000,1)*OFFSET(Admin!$AR$3,MATCH(\"MJ\",convSources,0),MATCH(K57,convTargets,0)),IF(N57=\"Kg\",VLOOKUP(\"F2-\"&Q57,Admin!BN:BT,6,FALSE)*OFFSET(Admin!$AR$3,MATCH(\"MJ\",convSources,0),MATCH(K57,convTargets,0)),IF(N57=\"m3\",VLOOKUP(\"F2-\"&Q57,Admin!BN:BT,7,FALSE)*OFFSET(Admin!$AR$3,MATCH(\"Kg\",convSources,0),MATCH(K57,convTargets,0)),OFFSET(Admin!$AR$3,MATCH(N57,convSources,0),MATCH(K57,convTargets,0))))))","v":0},"Tonnes CO2-e","Auto-Calc",{"$f":"(J22 * OFFSET(Admin!$AR$3,MATCH(K22,convSources,0),MATCH(\"GJ\",convTargets,0)) )  *  IFERROR( VLOOKUP(A57 & \"-\" & H57,Admin!BN:BQ,4,FALSE),0)\n+ (J38 * OFFSET(Admin!$AR$3,MATCH(K38,convSources,0),MATCH(\"GJ\",convTargets,0)) )  *  IFERROR( VLOOKUP(A57 & \"-\" & H57,Admin!BN:BQ,4,FALSE),0)","v":0},"Tonnes CO2-e",{"$f":"IF(OR(L57=\"Segment Aggregation\",L57=\"Auto-Calc\"),\"NA\",IF(AND(I57=\"Mandatory\",OR(M57=\"\",N57=\"\")), \"FAIL\", IF(I57=\"Optional\",\"NA\",\"PASS\")))","v":"NA"},null,"Fuel Oil",{"$f":"(J22 * OFFSET(Admin!$AR$3,MATCH(K22,convSources,0),MATCH(\"GJ\",convTargets,0)) )  *  IFERROR( VLOOKUP(A57 & \"-\" & H57,Admin!BN:CC,14,FALSE),0)\n+ (J38 * OFFSET(Admin!$AR$3,MATCH(K38,convSources,0),MATCH(\"GJ\",convTargets,0)) )  *  IFERROR( VLOOKUP(A57 & \"-\" & H57,Admin!BN:CC,14,FALSE),0)","v":0},{"$f":"(J22 * OFFSET(Admin!$AR$3,MATCH(K22,convSources,0),MATCH(\"GJ\",convTargets,0)) )  *  IFERROR( VLOOKUP(A57 & \"-\" & H57,Admin!BN:CC,15,FALSE),0)\n+ (J38 * OFFSET(Admin!$AR$3,MATCH(K38,convSources,0),MATCH(\"GJ\",convTargets,0)) )  *  IFERROR( VLOOKUP(A57 & \"-\" & H57,Admin!BN:CC,15,FALSE),0)","v":0},{"$f":"(J22 * OFFSET(Admin!$AR$3,MATCH(K22,convSources,0),MATCH(\"GJ\",convTargets,0)) )  *  IFERROR( VLOOKUP(A57 & \"-\" & H57,Admin!BN:CC,16,FALSE),0)\n+ (J38 * OFFSET(Admin!$AR$3,MATCH(K38,convSources,0),MATCH(\"GJ\",convTargets,0)) )  *  IFERROR( VLOOKUP(A57 & \"-\" & H57,Admin!BN:CC,16,FALSE),0)","v":0}]
["F2","F2.7","F2","Solid Fuel",1,null,null,"Solid Fuel","Optional",{"$f":"IF(N58=\"NA\",_xlfn.VALUETOTEXT(M58),M58*IF(OR(N58=\"L\", N58=\"kL\"),VLOOKUP(\"F2-\"&Q58,Admin!BN:BT,5,FALSE)*IF(N58=\"kL\",1000,1)*OFFSET(Admin!$AR$3,MATCH(\"MJ\",convSources,0),MATCH(K58,convTargets,0)),IF(N58=\"Kg\",VLOOKUP(\"F2-\"&Q58,Admin!BN:BT,6,FALSE)*OFFSET(Admin!$AR$3,MATCH(\"MJ\",convSources,0),MATCH(K58,convTargets,0)),IF(N58=\"m3\",VLOOKUP(\"F2-\"&Q58,Admin!BN:BT,7,FALSE)*OFFSET(Admin!$AR$3,MATCH(\"Kg\",convSources,0),MATCH(K58,convTargets,0)),OFFSET(Admin!$AR$3,MATCH(N58,convSources,0),MATCH(K58,convTargets,0))))))","v":0},"Tonnes CO2-e","Segment Aggregation",{"$f":"SUMIF(C:C,B58,J:J)","v":0},"Tonnes CO2-e","NA",null,"Solid Fuel"]
["F2","F2.7.1","F2.7","Solid FuelFRDSegmentSplitDry wood",2,null,null,"Dry wood","Optional",{"$f":"IF(N59=\"NA\",_xlfn.VALUETOTEXT(M59),M59*IF(OR(N59=\"L\", N59=\"kL\"),VLOOKUP(\"F2-\"&Q59,Admin!BN:BT,5,FALSE)*IF(N59=\"kL\",1000,1)*OFFSET(Admin!$AR$3,MATCH(\"MJ\",convSources,0),MATCH(K59,convTargets,0)),IF(N59=\"Kg\",VLOOKUP(\"F2-\"&Q59,Admin!BN:BT,6,FALSE)*OFFSET(Admin!$AR$3,MATCH(\"MJ\",convSources,0),MATCH(K59,convTargets,0)),IF(N59=\"m3\",VLOOKUP(\"F2-\"&Q59,Admin!BN:BT,7,FALSE)*OFFSET(Admin!$AR$3,MATCH(\"Kg\",convSources,0),MATCH(K59,convTargets,0)),OFFSET(Admin!$AR$3,MATCH(N59,convSources,0),MATCH(K59,convTargets,0))))))","v":0},"Tonnes CO2-e","Auto-Calc",{"$f":"(J24 * OFFSET(Admin!$AR$3,MATCH(K24,convSources,0),MATCH(\"GJ\",convTargets,0)) )  *  IFERROR( VLOOKUP(A59 & \"-\" & H59,Admin!BN:BQ,4,FALSE),0)\n+ (J40 * OFFSET(Admin!$AR$3,MATCH(K40,convSources,0),MATCH(\"GJ\",convTargets,0)) )  *  IFERROR( VLOOKUP(A59 & \"-\" & H59,Admin!BN:BQ,4,FALSE),0)","v":0},"Tonnes CO2-e","NA",null,"Dry wood",{"$f":"(J24 * OFFSET(Admin!$AR$3,MATCH(K24,convSources,0),MATCH(\"GJ\",convTargets,0)) )  *  IFERROR( VLOOKUP(A59 & \"-\" & H59,Admin!BN:CC,14,FALSE),0)\n+ (J40 * OFFSET(Admin!$AR$3,MATCH(K40,convSources,0),MATCH(\"GJ\",convTargets,0)) )  *  IFERROR( VLOOKUP(A59 & \"-\" & H59,Admin!BN:CC,14,FALSE),0)","v":0},{"$f":"(J24 * OFFSET(Admin!$AR$3,MATCH(K24,convSources,0),MATCH(\"GJ\",convTargets,0)) )  *  IFERROR( VLOOKUP(A59 & \"-\" & H59,Admin!BN:CC,15,FALSE),0)\n+ (J40 * OFFSET(Admin!$AR$3,MATCH(K40,convSources,0),MATCH(\"GJ\",convTargets,0)) )  *  IFERROR( VLOOKUP(A59 & \"-\" & H59,Admin!BN:CC,15,FALSE),0)","v":0},{"$f":"(J24 * OFFSET(Admin!$AR$3,MATCH(K24,convSources,0),MATCH(\"GJ\",convTargets,0)) )  *  IFERROR( VLOOKUP(A59 & \"-\" & H59,Admin!BN:CC,16,FALSE),0)\n+ (J40 * OFFSET(Admin!$AR$3,MATCH(K40,convSources,0),MATCH(\"GJ\",convTargets,0)) )  *  IFERROR( VLOOKUP(A59 & \"-\" & H59,Admin!BN:CC,16,FALSE),0)","v":0}]
["F2","F2.7.2","F2.7","Solid FuelFRDSegmentSplitGreen and air dried wood",2,null,null,"Green and air dried wood","Optional",{"$f":"IF(N60=\"NA\",_xlfn.VALUETOTEXT(M60),M60*IF(OR(N60=\"L\", N60=\"kL\"),VLOOKUP(\"F2-\"&Q60,Admin!BN:BT,5,FALSE)*IF(N60=\"kL\",1000,1)*OFFSET(Admin!$AR$3,MATCH(\"MJ\",convSources,0),MATCH(K60,convTargets,0)),IF(N60=\"Kg\",VLOOKUP(\"F2-\"&Q60,Admin!BN:BT,6,FALSE)*OFFSET(Admin!$AR$3,MATCH(\"MJ\",convSources,0),MATCH(K60,convTargets,0)),IF(N60=\"m3\",VLOOKUP(\"F2-\"&Q60,Admin!BN:BT,7,FALSE)*OFFSET(Admin!$AR$3,MATCH(\"Kg\",convSources,0),MATCH(K60,convTargets,0)),OFFSET(Admin!$AR$3,MATCH(N60,convSources,0),MATCH(K60,convTargets,0))))))","v":0},"Tonnes CO2-e","Auto-Calc",{"$f":"(J25 * OFFSET(Admin!$AR$3,MATCH(K25,convSources,0),MATCH(\"GJ\",convTargets,0)) )  *  IFERROR( VLOOKUP(A60 & \"-\" & H60,Admin!BN:BQ,4,FALSE),0)\n+ (J41 * OFFSET(Admin!$AR$3,MATCH(K41,convSources,0),MATCH(\"GJ\",convTargets,0)) )  *  IFERROR( VLOOKUP(A60 & \"-\" & H60,Admin!BN:BQ,4,FALSE),0)","v":0},"Tonnes CO2-e","NA",null,"Green and air dried wood",{"$f":"(J25 * OFFSET(Admin!$AR$3,MATCH(K25,convSources,0),MATCH(\"GJ\",convTargets,0)) )  *  IFERROR( VLOOKUP(A60 & \"-\" & H60,Admin!BN:CC,14,FALSE),0)\n+ (J41 * OFFSET(Admin!$AR$3,MATCH(K41,convSources,0),MATCH(\"GJ\",convTargets,0)) )  *  IFERROR( VLOOKUP(A60 & \"-\" & H60,Admin!BN:CC,14,FALSE),0)","v":0},{"$f":"(J25 * OFFSET(Admin!$AR$3,MATCH(K25,convSources,0),MATCH(\"GJ\",convTargets,0)) )  *  IFERROR( VLOOKUP(A60 & \"-\" & H60,Admin!BN:CC,15,FALSE),0)\n+ (J41 * OFFSET(Admin!$AR$3,MATCH(K41,convSources,0),MATCH(\"GJ\",convTargets,0)) )  *  IFERROR( VLOOKUP(A60 & \"-\" & H60,Admin!BN:CC,15,FALSE),0)","v":0},{"$f":"(J25 * OFFSET(Admin!$AR$3,MATCH(K25,convSources,0),MATCH(\"GJ\",convTargets,0)) )  *  IFERROR( VLOOKUP(A60 & \"-\" & H60,Admin!BN:CC,16,FALSE),0)\n+ (J41 * OFFSET(Admin!$AR$3,MATCH(K41,convSources,0),MATCH(\"GJ\",convTargets,0)) )  *  IFERROR( VLOOKUP(A60 & \"-\" & H60,Admin!BN:CC,16,FALSE),0)","v":0}]
["F2","F2.7.3","F2.7","Solid FuelFRDSegmentSplitBagasse",2,null,null,"Bagasse","Optional",{"$f":"IF(N61=\"NA\",_xlfn.VALUETOTEXT(M61),M61*IF(OR(N61=\"L\", N61=\"kL\"),VLOOKUP(\"F2-\"&Q61,Admin!BN:BT,5,FALSE)*IF(N61=\"kL\",1000,1)*OFFSET(Admin!$AR$3,MATCH(\"MJ\",convSources,0),MATCH(K61,convTargets,0)),IF(N61=\"Kg\",VLOOKUP(\"F2-\"&Q61,Admin!BN:BT,6,FALSE)*OFFSET(Admin!$AR$3,MATCH(\"MJ\",convSources,0),MATCH(K61,convTargets,0)),IF(N61=\"m3\",VLOOKUP(\"F2-\"&Q61,Admin!BN:BT,7,FALSE)*OFFSET(Admin!$AR$3,MATCH(\"Kg\",convSources,0),MATCH(K61,convTargets,0)),OFFSET(Admin!$AR$3,MATCH(N61,convSources,0),MATCH(K61,convTargets,0))))))","v":0},"Tonnes CO2-e","Auto-Calc",{"$f":"(J26 * OFFSET(Admin!$AR$3,MATCH(K26,convSources,0),MATCH(\"GJ\",convTargets,0)) )  *  IFERROR( VLOOKUP(A61 & \"-\" & H61,Admin!BN:BQ,4,FALSE),0)\n+ (J42 * OFFSET(Admin!$AR$3,MATCH(K42,convSources,0),MATCH(\"GJ\",convTargets,0)) )  *  IFERROR( VLOOKUP(A61 & \"-\" & H61,Admin!BN:BQ,4,FALSE),0)","v":0},"Tonnes CO2-e","NA",null,"Bagasse",{"$f":"(J26 * OFFSET(Admin!$AR$3,MATCH(K26,convSources,0),MATCH(\"GJ\",convTargets,0)) )  *  IFERROR( VLOOKUP(A61 & \"-\" & H61,Admin!BN:CC,14,FALSE),0)\n+ (J42 * OFFSET(Admin!$AR$3,MATCH(K42,convSources,0),MATCH(\"GJ\",convTargets,0)) )  *  IFERROR( VLOOKUP(A61 & \"-\" & H61,Admin!BN:CC,14,FALSE),0)","v":0},{"$f":"(J26 * OFFSET(Admin!$AR$3,MATCH(K26,convSources,0),MATCH(\"GJ\",convTargets,0)) )  *  IFERROR( VLOOKUP(A61 & \"-\" & H61,Admin!BN:CC,15,FALSE),0)\n+ (J42 * OFFSET(Admin!$AR$3,MATCH(K42,convSources,0),MATCH(\"GJ\",convTargets,0)) )  *  IFERROR( VLOOKUP(A61 & \"-\" & H61,Admin!BN:CC,15,FALSE),0)","v":0},{"$f":"(J26 * OFFSET(Admin!$AR$3,MATCH(K26,convSources,0),MATCH(\"GJ\",convTargets,0)) )  *  IFERROR( VLOOKUP(A61 & \"-\" & H61,Admin!BN:CC,16,FALSE),0)\n+ (J42 * OFFSET(Admin!$AR$3,MATCH(K42,convSources,0),MATCH(\"GJ\",convTargets,0)) )  *  IFERROR( VLOOKUP(A61 & \"-\" & H61,Admin!BN:CC,16,FALSE),0)","v":0}]
["F2","F2.7.4","F2.7","Solid FuelFRDSegmentSplitBiomass municipal and other industrial materials",2,null,null,"Biomass municipal and other industrial materials","Optional",{"$f":"IF(N62=\"NA\",_xlfn.VALUETOTEXT(M62),M62*IF(OR(N62=\"L\", N62=\"kL\"),VLOOKUP(\"F2-\"&Q62,Admin!BN:BT,5,FALSE)*IF(N62=\"kL\",1000,1)*OFFSET(Admin!$AR$3,MATCH(\"MJ\",convSources,0),MATCH(K62,convTargets,0)),IF(N62=\"Kg\",VLOOKUP(\"F2-\"&Q62,Admin!BN:BT,6,FALSE)*OFFSET(Admin!$AR$3,MATCH(\"MJ\",convSources,0),MATCH(K62,convTargets,0)),IF(N62=\"m3\",VLOOKUP(\"F2-\"&Q62,Admin!BN:BT,7,FALSE)*OFFSET(Admin!$AR$3,MATCH(\"Kg\",convSources,0),MATCH(K62,convTargets,0)),OFFSET(Admin!$AR$3,MATCH(N62,convSources,0),MATCH(K62,convTargets,0))))))","v":0},"Tonnes CO2-e","Auto-Calc",{"$f":"(J27 * OFFSET(Admin!$AR$3,MATCH(K27,convSources,0),MATCH(\"GJ\",convTargets,0)) )  *  IFERROR( VLOOKUP(A62 & \"-\" & H62,Admin!BN:BQ,4,FALSE),0)\n+ (J43 * OFFSET(Admin!$AR$3,MATCH(K43,convSources,0),MATCH(\"GJ\",convTargets,0)) )  *  IFERROR( VLOOKUP(A62 & \"-\" & H62,Admin!BN:BQ,4,FALSE),0)","v":0},"Tonnes CO2-e","NA",null,"Biomass municipal and other industrial materials",{"$f":"(J27 * OFFSET(Admin!$AR$3,MATCH(K27,convSources,0),MATCH(\"GJ\",convTargets,0)) )  *  IFERROR( VLOOKUP(A62 & \"-\" & H62,Admin!BN:CC,14,FALSE),0)\n+ (J43 * OFFSET(Admin!$AR$3,MATCH(K43,convSources,0),MATCH(\"GJ\",convTargets,0)) )  *  IFERROR( VLOOKUP(A62 & \"-\" & H62,Admin!BN:CC,14,FALSE),0)","v":0},{"$f":"(J27 * OFFSET(Admin!$AR$3,MATCH(K27,convSources,0),MATCH(\"GJ\",convTargets,0)) )  *  IFERROR( VLOOKUP(A62 & \"-\" & H62,Admin!BN:CC,15,FALSE),0)\n+ (J43 * OFFSET(Admin!$AR$3,MATCH(K43,convSources,0),MATCH(\"GJ\",convTargets,0)) )  *  IFERROR( VLOOKUP(A62 & \"-\" & H62,Admin!BN:CC,15,FALSE),0)","v":0},{"$f":"(J27 * OFFSET(Admin!$AR$3,MATCH(K27,convSources,0),MATCH(\"GJ\",convTargets,0)) )  *  IFERROR( VLOOKUP(A62 & \"-\" & H62,Admin!BN:CC,16,FALSE),0)\n+ (J43 * OFFSET(Admin!$AR$3,MATCH(K43,convSources,0),MATCH(\"GJ\",convTargets,0)) )  *  IFERROR( VLOOKUP(A62 & \"-\" & H62,Admin!BN:CC,16,FALSE),0)","v":0}]
["F2","F2.7.5","F2.7","Solid FuelFRDSegmentSplitCharcoal",2,null,null,"Charcoal","Optional",{"$f":"IF(N63=\"NA\",_xlfn.VALUETOTEXT(M63),M63*IF(OR(N63=\"L\", N63=\"kL\"),VLOOKUP(\"F2-\"&Q63,Admin!BN:BT,5,FALSE)*IF(N63=\"kL\",1000,1)*OFFSET(Admin!$AR$3,MATCH(\"MJ\",convSources,0),MATCH(K63,convTargets,0)),IF(N63=\"Kg\",VLOOKUP(\"F2-\"&Q63,Admin!BN:BT,6,FALSE)*OFFSET(Admin!$AR$3,MATCH(\"MJ\",convSources,0),MATCH(K63,convTargets,0)),IF(N63=\"m3\",VLOOKUP(\"F2-\"&Q63,Admin!BN:BT,7,FALSE)*OFFSET(Admin!$AR$3,MATCH(\"Kg\",convSources,0),MATCH(K63,convTargets,0)),OFFSET(Admin!$AR$3,MATCH(N63,convSources,0),MATCH(K63,convTargets,0))))))","v":0},"Tonnes CO2-e","Auto-Calc",{"$f":"(J28 * OFFSET(Admin!$AR$3,MATCH(K28,convSources,0),MATCH(\"GJ\",convTargets,0)) )  *  IFERROR( VLOOKUP(A63 & \"-\" & H63,Admin!BN:BQ,4,FALSE),0)\n+ (J44 * OFFSET(Admin!$AR$3,MATCH(K44,convSources,0),MATCH(\"GJ\",convTargets,0)) )  *  IFERROR( VLOOKUP(A63 & \"-\" & H63,Admin!BN:BQ,4,FALSE),0)","v":0},"Tonnes CO2-e","NA",null,"Charcoal",{"$f":"(J28 * OFFSET(Admin!$AR$3,MATCH(K28,convSources,0),MATCH(\"GJ\",convTargets,0)) )  *  IFERROR( VLOOKUP(A63 & \"-\" & H63,Admin!BN:CC,14,FALSE),0)\n+ (J44 * OFFSET(Admin!$AR$3,MATCH(K44,convSources,0),MATCH(\"GJ\",convTargets,0)) )  *  IFERROR( VLOOKUP(A63 & \"-\" & H63,Admin!BN:CC,14,FALSE),0)","v":0},{"$f":"(J28 * OFFSET(Admin!$AR$3,MATCH(K28,convSources,0),MATCH(\"GJ\",convTargets,0)) )  *  IFERROR( VLOOKUP(A63 & \"-\" & H63,Admin!BN:CC,15,FALSE),0)\n+ (J44 * OFFSET(Admin!$AR$3,MATCH(K44,convSources,0),MATCH(\"GJ\",convTargets,0)) )  *  IFERROR( VLOOKUP(A63 & \"-\" & H63,Admin!BN:CC,15,FALSE),0)","v":0},{"$f":"(J28 * OFFSET(Admin!$AR$3,MATCH(K28,convSources,0),MATCH(\"GJ\",convTargets,0)) )  *  IFERROR( VLOOKUP(A63 & \"-\" & H63,Admin!BN:CC,16,FALSE),0)\n+ (J44 * OFFSET(Admin!$AR$3,MATCH(K44,convSources,0),MATCH(\"GJ\",convTargets,0)) )  *  IFERROR( VLOOKUP(A63 & \"-\" & H63,Admin!BN:CC,16,FALSE),0)","v":0}]
["F2","F2.7.6","F2.7","Solid FuelFRDSegmentSplitAnthracite coal",{"$f":"IFERROR(LEN(B64)-LEN(SUBSTITUTE(B64,\".\",\"\") ),\"BAD VALUE\")","v":2},null,null,"Anthracite coal",{"$f":"IF(VLOOKUP(A64,TierIndicators,3,FALSE)=\"Yes\", \"Mandatory\", \"Optional\")","v":"Optional"},{"$f":"IF(N64=\"NA\",_xlfn.VALUETOTEXT(M64),M64*IF(OR(N64=\"L\", N64=\"kL\"),VLOOKUP(\"F2-\"&Q64,Admin!BN:BT,5,FALSE)*IF(N64=\"kL\",1000,1)*OFFSET(Admin!$AR$3,MATCH(\"MJ\",convSources,0),MATCH(K64,convTargets,0)),IF(N64=\"Kg\",VLOOKUP(\"F2-\"&Q64,Admin!BN:BT,6,FALSE)*OFFSET(Admin!$AR$3,MATCH(\"MJ\",convSources,0),MATCH(K64,convTargets,0)),IF(N64=\"m3\",VLOOKUP(\"F2-\"&Q64,Admin!BN:BT,7,FALSE)*OFFSET(Admin!$AR$3,MATCH(\"Kg\",convSources,0),MATCH(K64,convTargets,0)),OFFSET(Admin!$AR$3,MATCH(N64,convSources,0),MATCH(K64,convTargets,0))))))","v":0},"Tonnes CO2-e","Auto-Calc",{"$f":"(J29 * OFFSET(Admin!$AR$3,MATCH(K29,convSources,0),MATCH(\"GJ\",convTargets,0)) )  *  IFERROR( VLOOKUP(A64 & \"-\" & H64,Admin!BN:BQ,4,FALSE),0)\n+ (J45 * OFFSET(Admin!$AR$3,MATCH(K45,convSources,0),MATCH(\"GJ\",convTargets,0)) )  *  IFERROR( VLOOKUP(A64 & \"-\" & H64,Admin!BN:BQ,4,FALSE),0)","v":0},"Tonnes CO2-e",{"$f":"IF(OR(L64=\"Segment Aggregation\",L64=\"Auto-Calc\"),\"NA\",IF(AND(I64=\"Mandatory\",OR(M64=\"\",N64=\"\")), \"FAIL\", IF(I64=\"Optional\",\"NA\",\"PASS\")))","v":"NA"},null,"Anthracite coal",{"$f":"(J29 * OFFSET(Admin!$AR$3,MATCH(K29,convSources,0),MATCH(\"GJ\",convTargets,0)) )  *  IFERROR( VLOOKUP(A64 & \"-\" & H64,Admin!BN:CC,14,FALSE),0)\n+ (J45 * OFFSET(Admin!$AR$3,MATCH(K45,convSources,0),MATCH(\"GJ\",convTargets,0)) )  *  IFERROR( VLOOKUP(A64 & \"-\" & H64,Admin!BN:CC,14,FALSE),0)","v":0},{"$f":"(J29 * OFFSET(Admin!$AR$3,MATCH(K29,convSources,0),MATCH(\"GJ\",convTargets,0)) )  *  IFERROR( VLOOKUP(A64 & \"-\" & H64,Admin!BN:CC,15,FALSE),0)\n+ (J45 * OFFSET(Admin!$AR$3,MATCH(K45,convSources,0),MATCH(\"GJ\",convTargets,0)) )  *  IFERROR( VLOOKUP(A64 & \"-\" & H64,Admin!BN:CC,15,FALSE),0)","v":0},{"$f":"(J29 * OFFSET(Admin!$AR$3,MATCH(K29,convSources,0),MATCH(\"GJ\",convTargets,0)) )  *  IFERROR( VLOOKUP(A64 & \"-\" & H64,Admin!BN:CC,16,FALSE),0)\n+ (J45 * OFFSET(Admin!$AR$3,MATCH(K45,convSources,0),MATCH(\"GJ\",convTargets,0)) )  *  IFERROR( VLOOKUP(A64 & \"-\" & H64,Admin!BN:CC,16,FALSE),0)","v":0}]
["F2","F2.7.7","F2.7","Solid FuelFRDSegmentSplitBituminous coal",{"$f":"IFERROR(LEN(B65)-LEN(SUBSTITUTE(B65,\".\",\"\") ),\"BAD VALUE\")","v":2},null,null,"Bituminous coal",{"$f":"IF(VLOOKUP(A65,TierIndicators,3,FALSE)=\"Yes\", \"Mandatory\", \"Optional\")","v":"Optional"},{"$f":"IF(N65=\"NA\",_xlfn.VALUETOTEXT(M65),M65*IF(OR(N65=\"L\", N65=\"kL\"),VLOOKUP(\"F2-\"&Q65,Admin!BN:BT,5,FALSE)*IF(N65=\"kL\",1000,1)*OFFSET(Admin!$AR$3,MATCH(\"MJ\",convSources,0),MATCH(K65,convTargets,0)),IF(N65=\"Kg\",VLOOKUP(\"F2-\"&Q65,Admin!BN:BT,6,FALSE)*OFFSET(Admin!$AR$3,MATCH(\"MJ\",convSources,0),MATCH(K65,convTargets,0)),IF(N65=\"m3\",VLOOKUP(\"F2-\"&Q65,Admin!BN:BT,7,FALSE)*OFFSET(Admin!$AR$3,MATCH(\"Kg\",convSources,0),MATCH(K65,convTargets,0)),OFFSET(Admin!$AR$3,MATCH(N65,convSources,0),MATCH(K65,convTargets,0))))))","v":0},"Tonnes CO2-e","Auto-Calc",{"$f":"(J30 * OFFSET(Admin!$AR$3,MATCH(K30,convSources,0),MATCH(\"GJ\",convTargets,0)) )  *  IFERROR( VLOOKUP(A65 & \"-\" & H65,Admin!BN:BQ,4,FALSE),0)\n+ (J46 * OFFSET(Admin!$AR$3,MATCH(K46,convSources,0),MATCH(\"GJ\",convTargets,0)) )  *  IFERROR( VLOOKUP(A65 & \"-\" & H65,Admin!BN:BQ,4,FALSE),0)","v":0},"Tonnes CO2-e",{"$f":"IF(OR(L65=\"Segment Aggregation\",L65=\"Auto-Calc\"),\"NA\",IF(AND(I65=\"Mandatory\",OR(M65=\"\",N65=\"\")), \"FAIL\", IF(I65=\"Optional\",\"NA\",\"PASS\")))","v":"NA"},null,"Bituminous coal",{"$f":"(J30 * OFFSET(Admin!$AR$3,MATCH(K30,convSources,0),MATCH(\"GJ\",convTargets,0)) )  *  IFERROR( VLOOKUP(A65 & \"-\" & H65,Admin!BN:CC,14,FALSE),0)\n+ (J46 * OFFSET(Admin!$AR$3,MATCH(K46,convSources,0),MATCH(\"GJ\",convTargets,0)) )  *  IFERROR( VLOOKUP(A65 & \"-\" & H65,Admin!BN:CC,14,FALSE),0)","v":0},{"$f":"(J30 * OFFSET(Admin!$AR$3,MATCH(K30,convSources,0),MATCH(\"GJ\",convTargets,0)) )  *  IFERROR( VLOOKUP(A65 & \"-\" & H65,Admin!BN:CC,15,FALSE),0)\n+ (J46 * OFFSET(Admin!$AR$3,MATCH(K46,convSources,0),MATCH(\"GJ\",convTargets,0)) )  *  IFERROR( VLOOKUP(A65 & \"-\" & H65,Admin!BN:CC,15,FALSE),0)","v":0},{"$f":"(J30 * OFFSET(Admin!$AR$3,MATCH(K30,convSources,0),MATCH(\"GJ\",convTargets,0)) )  *  IFERROR( VLOOKUP(A65 & \"-\" & H65,Admin!BN:CC,16,FALSE),0)\n+ (J46 * OFFSET(Admin!$AR$3,MATCH(K46,convSources,0),MATCH(\"GJ\",convTargets,0)) )  *  IFERROR( VLOOKUP(A65 & \"-\" & H65,Admin!BN:CC,16,FALSE),0)","v":0}]
["F2","F2.7.8","F2.7","Solid FuelFRDSegmentSplitCoal Briquettes",{"$f":"IFERROR(LEN(B66)-LEN(SUBSTITUTE(B66,\".\",\"\") ),\"BAD VALUE\")","v":2},null,null,"Coal Briquettes",{"$f":"IF(VLOOKUP(A66,TierIndicators,3,FALSE)=\"Yes\", \"Mandatory\", \"Optional\")","v":"Optional"},{"$f":"IF(N66=\"NA\",_xlfn.VALUETOTEXT(M66),M66*IF(OR(N66=\"L\", N66=\"kL\"),VLOOKUP(\"F2-\"&Q66,Admin!BN:BT,5,FALSE)*IF(N66=\"kL\",1000,1)*OFFSET(Admin!$AR$3,MATCH(\"MJ\",convSources,0),MATCH(K66,convTargets,0)),IF(N66=\"Kg\",VLOOKUP(\"F2-\"&Q66,Admin!BN:BT,6,FALSE)*OFFSET(Admin!$AR$3,MATCH(\"MJ\",convSources,0),MATCH(K66,convTargets,0)),IF(N66=\"m3\",VLOOKUP(\"F2-\"&Q66,Admin!BN:BT,7,FALSE)*OFFSET(Admin!$AR$3,MATCH(\"Kg\",convSources,0),MATCH(K66,convTargets,0)),OFFSET(Admin!$AR$3,MATCH(N66,convSources,0),MATCH(K66,convTargets,0))))))","v":0},"Tonnes CO2-e","Auto-Calc",{"$f":"(J31 * OFFSET(Admin!$AR$3,MATCH(K31,convSources,0),MATCH(\"GJ\",convTargets,0)) )  *  IFERROR( VLOOKUP(A66 & \"-\" & H66,Admin!BN:BQ,4,FALSE),0)\n+ (J47 * OFFSET(Admin!$AR$3,MATCH(K47,convSources,0),MATCH(\"GJ\",convTargets,0)) )  *  IFERROR( VLOOKUP(A66 & \"-\" & H66,Admin!BN:BQ,4,FALSE),0)","v":0},"Tonnes CO2-e",{"$f":"IF(OR(L66=\"Segment Aggregation\",L66=\"Auto-Calc\"),\"NA\",IF(AND(I66=\"Mandatory\",OR(M66=\"\",N66=\"\")), \"FAIL\", IF(I66=\"Optional\",\"NA\",\"PASS\")))","v":"NA"},null,"Coal Briquettes",{"$f":"(J31 * OFFSET(Admin!$AR$3,MATCH(K31,convSources,0),MATCH(\"GJ\",convTargets,0)) )  *  IFERROR( VLOOKUP(A66 & \"-\" & H66,Admin!BN:CC,14,FALSE),0)\n+ (J47 * OFFSET(Admin!$AR$3,MATCH(K47,convSources,0),MATCH(\"GJ\",convTargets,0)) )  *  IFERROR( VLOOKUP(A66 & \"-\" & H66,Admin!BN:CC,14,FALSE),0)","v":0},{"$f":"(J31 * OFFSET(Admin!$AR$3,MATCH(K31,convSources,0),MATCH(\"GJ\",convTargets,0)) )  *  IFERROR( VLOOKUP(A66 & \"-\" & H66,Admin!BN:CC,15,FALSE),0)\n+ (J47 * OFFSET(Admin!$AR$3,MATCH(K47,convSources,0),MATCH(\"GJ\",convTargets,0)) )  *  IFERROR( VLOOKUP(A66 & \"-\" & H66,Admin!BN:CC,15,FALSE),0)","v":0},{"$f":"(J31 * OFFSET(Admin!$AR$3,MATCH(K31,convSources,0),MATCH(\"GJ\",convTargets,0)) )  *  IFERROR( VLOOKUP(A66 & \"-\" & H66,Admin!BN:CC,16,FALSE),0)\n+ (J47 * OFFSET(Admin!$AR$3,MATCH(K47,convSources,0),MATCH(\"GJ\",convTargets,0)) )  *  IFERROR( VLOOKUP(A66 & \"-\" & H66,Admin!BN:CC,16,FALSE),0)","v":0}]

{"sheet":"Transportation","index":10,"n_rows":228,"n_cols":22,"rows_kept":228,"cut":false,"hidden":false,"merged":[[5,1,5,6],[58,2,58,12],[178,2,178,12],[224,2,224,12],[12,2,12,12]]}
[]
[]
[]
[]
[]
[null,{"$f":"Agency&\" | \"&Tier&\" | \"&ReportingPeriod","v":" |  |  - "}]
[]
[null,"<- Back to Home",null,null,null,"Sheet complete:",null,{"$f":"IFERROR(IF(COUNTIF(O:O,\"Pass\")+COUNTIF(O:O,\"FAIL\")=0,\"NA\",IF(VLOOKUP(\"FAIL\",O:O,1,FALSE) = \"FAIL\", IF(COUNTIF(O:O,\"Pass\")=0,\"Not Started\",\"In Progress\"),\"Complete\")),\"Complete\")","v":"NA"}," "]
[null,null,null,null,null,null,null,{"$f":"IF(NOT(OR(H8=\"Complete\",H8=\"NA\")),\"*Mandatory values have not been entered, revisit highlighted items\",\"\")","v":""}]
[null,"Transportation - Reporting"]
[]
[]
[null,"T1","Total energy used in transportation within the Entity, segmented by fuel type and vehicle category"]
[null,"ID","Parent ID","FRDSegment","Segment Level",null,null,"Description","Flag","Final Value","Final Unit","Input Type","Input Value","Input Unit","CHECK"]
["T1","T1","NA",{"$f":"IF(E15=1,H15,IFERROR(VLOOKUP(C15,$B$14:$D$1048576,3,FALSE)&\"FRDSegmentSplit\"&H15,H15))","v":"GRAND TOTAL"},{"$f":"IFERROR(LEN(B15)-LEN(SUBSTITUTE(B15,\".\",\"\") ),\"BAD VALUE\")","v":0},null,null,"GRAND TOTAL",{"$f":"IF(VLOOKUP(A15,TierIndicators,3,FALSE)=\"Yes\", \"Mandatory\", \"Optional\")","v":"Optional"},{"$f":"IF(N15=\"NA\",_xlfn.VALUETOTEXT(M15),M15*IF(OR(N15=\"L\", N15=\"kL\"),VLOOKUP(\"T3-\"&Q15,Admin!BN:BT,5,FALSE)*IF(N15=\"kL\",1000,1)*OFFSET(Admin!$AR$3,MATCH(\"GJ\",convSources,0),MATCH(K15,convTargets,0)),IF(OR(N15=\"Kg\",N15=\"Tonnes\"),VLOOKUP(\"F2-\"&Q15,Admin!BN:BT,6,FALSE)*IF(N15=\"Tonnes\",1000,1)*OFFSET(Admin!$AR$3,MATCH(\"GJ\",convSources,0),MATCH(K15,convTargets,0)),IF(N15=\"m3\",VLOOKUP(\"F2-\"&Q15,Admin!BN:BT,7,FALSE)*OFFSET(Admin!$AR$3,MATCH(\"Kg\",convSources,0),MATCH(K15,convTargets,0)),OFFSET(Admin!$AR$3,MATCH(N15,convSources,0),MATCH(K15,convTargets,0))))))","v":0},"MJ","Segment Aggregation",{"$f":"SUMIF(C:C,B15,R:R)-J51*OFFSET(Admin!$AR$3,MATCH(K51,convSources,0),MATCH(K15,convTargets,0))","v":0},"MJ",{"$f":"IF(OR(L15=\"Segment Aggregation\",L15=\"Auto-Calc\"),\"NA\",IF(AND(I15=\"Mandatory\",OR(M15=\"\",N15=\"\")), \"FAIL\", IF(I15=\"Optional\",\"NA\",\"PASS\")))","v":"NA"},null,"GRAND TOTAL"]
["T1","T1.1","T1","Petrol",1,null,null,"Petrol","Optional",{"$f":"IF(N16=\"NA\",_xlfn.VALUETOTEXT(M16),M16*IF(OR(N16=\"L\", N16=\"kL\"),VLOOKUP(\"T3-\"&Q16,Admin!BN:BT,5,FALSE)*IF(N16=\"kL\",1000,1)*OFFSET(Admin!$AR$3,MATCH(\"GJ\",convSources,0),MATCH(K16,convTargets,0)),IF(OR(N16=\"Kg\",N16=\"Tonnes\"),VLOOKUP(\"F2-\"&Q16,Admin!BN:BT,6,FALSE)*IF(N16=\"Tonnes\",1000,1)*OFFSET(Admin!$AR$3,MATCH(\"GJ\",convSources,0),MATCH(K16,convTargets,0)),IF(N16=\"m3\",VLOOKUP(\"F2-\"&Q16,Admin!BN:BT,7,FALSE)*OFFSET(Admin!$AR$3,MATCH(\"Kg\",convSources,0),MATCH(K16,convTargets,0)),OFFSET(Admin!$AR$3,MATCH(N16,convSources,0),MATCH(K16,convTargets,0))))))","v":0},"MJ","Segment Aggregation",{"$f":"SUMIF(C:C,B16,J:J)","v":0},"MJ","NA",null,"Petrol",{"$f":"J16*OFFSET(Admin!$AR$3,MATCH(K16,convSources,0),MATCH(K$15,convTargets,0))","v":0}]
["T1","T1.1.1","T1.1","PetrolFRDSegmentSplitPetrol (Unleaded/Premium)",2,null,null,"Petrol (Unleaded/Premium)","Optional",{"$f":"IF(N17=\"NA\",_xlfn.VALUETOTEXT(M17),M17*IF(OR(N17=\"L\", N17=\"kL\"),VLOOKUP(\"T3-\"&Q17,Admin!BN:BT,5,FALSE)*IF(N17=\"kL\",1000,1)*OFFSET(Admin!$AR$3,MATCH(\"GJ\",convSources,0),MATCH(K17,convTargets,0)),IF(OR(N17=\"Kg\",N17=\"Tonnes\"),VLOOKUP(\"F2-\"&Q17,Admin!BN:BT,6,FALSE)*IF(N17=\"Tonnes\",1000,1)*OFFSET(Admin!$AR$3,MATCH(\"GJ\",convSources,0),MATCH(K17,convTargets,0)),IF(N17=\"m3\",VLOOKUP(\"F2-\"&Q17,Admin!BN:BT,7,FALSE)*OFFSET(Admin!$AR$3,MATCH(\"Kg\",convSources,0),MATCH(K17,convTargets,0)),OFFSET(Admin!$AR$3,MATCH(N17,convSources,0),MATCH(K17,convTargets,0))))))","v":0},"MJ","Segment Aggregation",{"$f":"SUMIF(C:C,B17,J:J)","v":0},"MJ","NA",null,"Petrol (Unleaded/Premium)",{"$f":"J17*OFFSET(Admin!$AR$3,MATCH(K17,convSources,0),MATCH(K$15,convTargets,0))","v":0}]
["T1","T1.1.1.1","T1.1.1","PetrolFRDSegmentSplitPetrol (Unleaded/Premium)FRDSegmentSplitRoad vehicles",3,"+ (add segment)",null,"Road vehicles","Optional",{"$f":"IF(N18=\"NA\",_xlfn.VALUETOTEXT(M18),M18*IF(OR(N18=\"L\", N18=\"kL\"),VLOOKUP(\"T3-\"&Q18,Admin!BN:BT,5,FALSE)*IF(N18=\"kL\",1000,1)*OFFSET(Admin!$AR$3,MATCH(\"GJ\",convSources,0),MATCH(K18,convTargets,0)),IF(OR(N18=\"Kg\",N18=\"Tonnes\"),VLOOKUP(\"F2-\"&Q18,Admin!BN:BT,6,FALSE)*IF(N18=\"Tonnes\",1000,1)*OFFSET(Admin!$AR$3,MATCH(\"GJ\",convSources,0),MATCH(K18,convTargets,0)),IF(N18=\"m3\",VLOOKUP(\"F2-\"&Q18,Admin!BN:BT,7,FALSE)*OFFSET(Admin!$AR$3,MATCH(\"Kg\",convSources,0),MATCH(K18,convTargets,0)),OFFSET(Admin!$AR$3,MATCH(N18,convSources,0),MATCH(K18,convTargets,0))))))","v":0},"MJ","Manual",null,"kL","NA",null,"Petrol (Unleaded/Premium)",{"$f":"J18*OFFSET(Admin!$AR$3,MATCH(K18,convSources,0),MATCH(K$15,convTargets,0))","v":0}]
["T1","T1.1.1.2","T1.1.1","PetrolFRDSegmentSplitPetrol (Unleaded/Premium)FRDSegmentSplitNon-road vehicles",{"$f":"IFERROR(LEN(B19)-LEN(SUBSTITUTE(B19,\".\",\"\") ),\"BAD VALUE\")","v":3},"+ (add segment)",null,"Non-road vehicles","Optional",{"$f":"IF(N19=\"NA\",_xlfn.VALUETOTEXT(M19),M19*IF(OR(N19=\"L\", N19=\"kL\"),VLOOKUP(\"T3-\"&Q19,Admin!BN:BT,5,FALSE)*IF(N19=\"kL\",1000,1)*OFFSET(Admin!$AR$3,MATCH(\"GJ\",convSources,0),MATCH(K19,convTargets,0)),IF(OR(N19=\"Kg\",N19=\"Tonnes\"),VLOOKUP(\"F2-\"&Q19,Admin!BN:BT,6,FALSE)*IF(N19=\"Tonnes\",1000,1)*OFFSET(Admin!$AR$3,MATCH(\"GJ\",convSources,0),MATCH(K19,convTargets,0)),IF(N19=\"m3\",VLOOKUP(\"F2-\"&Q19,Admin!BN:BT,7,FALSE)*OFFSET(Admin!$AR$3,MATCH(\"Kg\",convSources,0),MATCH(K19,convTargets,0)),OFFSET(Admin!$AR$3,MATCH(N19,convSources,0),MATCH(K19,convTargets,0))))))","v":0},"MJ","Manual",null,"kL","NA",null,"Petrol (Unleaded/Premium)",{"$f":"J19*OFFSET(Admin!$AR$3,MATCH(K19,convSources,0),MATCH(K$15,convTargets,0))","v":0}]
["T1","T1.1.2","T1.1","PetrolFRDSegmentSplitPetrol (E10)",2,null,null,"Petrol (E10)","Optional",{"$f":"IF(N20=\"NA\",_xlfn.VALUETOTEXT(M20),M20*IF(OR(N20=\"L\", N20=\"kL\"),VLOOKUP(\"T3-\"&Q20,Admin!BN:BT,5,FALSE)*IF(N20=\"kL\",1000,1)*OFFSET(Admin!$AR$3,MATCH(\"GJ\",convSources,0),MATCH(K20,convTargets,0)),IF(OR(N20=\"Kg\",N20=\"Tonnes\"),VLOOKUP(\"F2-\"&Q20,Admin!BN:BT,6,FALSE)*IF(N20=\"Tonnes\",1000,1)*OFFSET(Admin!$AR$3,MATCH(\"GJ\",convSources,0),MATCH(K20,convTargets,0)),IF(N20=\"m3\",VLOOKUP(\"F2-\"&Q20,Admin!BN:BT,7,FALSE)*OFFSET(Admin!$AR$3,MATCH(\"Kg\",convSources,0),MATCH(K20,convTargets,0)),OFFSET(Admin!$AR$3,MATCH(N20,convSources,0),MATCH(K20,convTargets,0))))))","v":0},"MJ","Segment Aggregation",{"$f":"SUMIF(C:C,B20,J:J)","v":0},"MJ","NA",null,"Petrol (E10)",{"$f":"J20*OFFSET(Admin!$AR$3,MATCH(K20,convSources,0),MATCH(K$15,convTargets,0))","v":0}]
["T1","T1.1.2.1","T1.1.2","PetrolFRDSegmentSplitPetrol (E10)FRDSegmentSplitRoad vehicles",3,"+ (add segment)",null,"Road vehicles","Optional",{"$f":"IF(N21=\"NA\",_xlfn.VALUETOTEXT(M21),M21*IF(OR(N21=\"L\", N21=\"kL\"),VLOOKUP(\"T3-\"&Q21,Admin!BN:BT,5,FALSE)*IF(N21=\"kL\",1000,1)*OFFSET(Admin!$AR$3,MATCH(\"GJ\",convSources,0),MATCH(K21,convTargets,0)),IF(OR(N21=\"Kg\",N21=\"Tonnes\"),VLOOKUP(\"F2-\"&Q21,Admin!BN:BT,6,FALSE)*IF(N21=\"Tonnes\",1000,1)*OFFSET(Admin!$AR$3,MATCH(\"GJ\",convSources,0),MATCH(K21,convTargets,0)),IF(N21=\"m3\",VLOOKUP(\"F2-\"&Q21,Admin!BN:BT,7,FALSE)*OFFSET(Admin!$AR$3,MATCH(\"Kg\",convSources,0),MATCH(K21,convTargets,0)),OFFSET(Admin!$AR$3,MATCH(N21,convSources,0),MATCH(K21,convTargets,0))))))","v":0},"MJ","Manual",null,"kL","NA",null,"Petrol (E10)",{"$f":"J21*OFFSET(Admin!$AR$3,MATCH(K21,convSources,0),MATCH(K$15,convTargets,0))","v":0}]
["T1","T1.1.2.2","T1.1.2","PetrolFRDSegmentSplitPetrol (E10)FRDSegmentSplitNon-road vehicles",3,"+ (add segment)",null,"Non-road vehicles","Optional",{"$f":"IF(N22=\"NA\",_xlfn.VALUETOTEXT(M22),M22*IF(OR(N22=\"L\", N22=\"kL\"),VLOOKUP(\"T3-\"&Q22,Admin!BN:BT,5,FALSE)*IF(N22=\"kL\",1000,1)*OFFSET(Admin!$AR$3,MATCH(\"GJ\",convSources,0),MATCH(K22,convTargets,0)),IF(OR(N22=\"Kg\",N22=\"Tonnes\"),VLOOKUP(\"F2-\"&Q22,Admin!BN:BT,6,FALSE)*IF(N22=\"Tonnes\",1000,1)*OFFSET(Admin!$AR$3,MATCH(\"GJ\",convSources,0),MATCH(K22,convTargets,0)),IF(N22=\"m3\",VLOOKUP(\"F2-\"&Q22,Admin!BN:BT,7,FALSE)*OFFSET(Admin!$AR$3,MATCH(\"Kg\",convSources,0),MATCH(K22,convTargets,0)),OFFSET(Admin!$AR$3,MATCH(N22,convSources,0),MATCH(K22,convTargets,0))))))","v":0},"MJ","Manual",null,"kL","NA",null,"Petrol (E10)",{"$f":"J22*OFFSET(Admin!$AR$3,MATCH(K22,convSources,0),MATCH(K$15,convTargets,0))","v":0}]
["T1","T1.2","T1","Diesel",1,null,null,"Diesel","Optional",{"$f":"IF(N23=\"NA\",_xlfn.VALUETOTEXT(M23),M23*IF(OR(N23=\"L\", N23=\"kL\"),VLOOKUP(\"T3-\"&Q23,Admin!BN:BT,5,FALSE)*IF(N23=\"kL\",1000,1)*OFFSET(Admin!$AR$3,MATCH(\"GJ\",convSources,0),MATCH(K23,convTargets,0)),IF(OR(N23=\"Kg\",N23=\"Tonnes\"),VLOOKUP(\"F2-\"&Q23,Admin!BN:BT,6,FALSE)*IF(N23=\"Tonnes\",1000,1)*OFFSET(Admin!$AR$3,MATCH(\"GJ\",convSources,0),MATCH(K23,convTargets,0)),IF(N23=\"m3\",VLOOKUP(\"F2-\"&Q23,Admin!BN:BT,7,FALSE)*OFFSET(Admin!$AR$3,MATCH(\"Kg\",convSources,0),MATCH(K23,convTargets,0)),OFFSET(Admin!$AR$3,MATCH(N23,convSources,0),MATCH(K23,convTargets,0))))))","v":0},"MJ","Segment Aggregation",{"$f":"SUMIF(C:C,B23,J:J)","v":0},"MJ","NA",null,"Diesel",{"$f":"J23*OFFSET(Admin!$AR$3,MATCH(K23,convSources,0),MATCH(K$15,convTargets,0))","v":0}]
["T1","T1.2.1","T1.2","DieselFRDSegmentSplitRoad vehicles",{"$f":"IFERROR(LEN(B24)-LEN(SUBSTITUTE(B24,\".\",\"\") ),\"BAD VALUE\")","v":2},"+ (add segment)",null,"Road vehicles","Optional",{"$f":"IF(N24=\"NA\",_xlfn.VALUETOTEXT(M24),M24*IF(OR(N24=\"L\", N24=\"kL\"),VLOOKUP(\"T3-\"&Q24,Admin!BN:BT,5,FALSE)*IF(N24=\"kL\",1000,1)*OFFSET(Admin!$AR$3,MATCH(\"GJ\",convSources,0),MATCH(K24,convTargets,0)),IF(OR(N24=\"Kg\",N24=\"Tonnes\"),VLOOKUP(\"F2-\"&Q24,Admin!BN:BT,6,FALSE)*IF(N24=\"Tonnes\",1000,1)*OFFSET(Admin!$AR$3,MATCH(\"GJ\",convSources,0),MATCH(K24,convTargets,0)),IF(N24=\"m3\",VLOOKUP(\"F2-\"&Q24,Admin!BN:BT,7,FALSE)*OFFSET(Admin!$AR$3,MATCH(\"Kg\",convSources,0),MATCH(K24,convTargets,0)),OFFSET(Admin!$AR$3,MATCH(N24,convSources,0),MATCH(K24,convTargets,0))))))","v":0},"MJ","Manual",null,"kL","NA",null,"Diesel",{"$f":"J24*OFFSET(Admin!$AR$3,MATCH(K24,convSources,0),MATCH(K$15,convTargets,0))","v":0}]
["T1","T1.2.2","T1.2","DieselFRDSegmentSplitNon-road vehicles",{"$f":"IFERROR(LEN(B25)-LEN(SUBSTITUTE(B25,\".\",\"\") ),\"BAD VALUE\")","v":2},"+ (add segment)",null,"Non-road vehicles","Optional",{"$f":"IF(N25=\"NA\",_xlfn.VALUETOTEXT(M25),M25*IF(OR(N25=\"L\", N25=\"kL\"),VLOOKUP(\"T3-\"&Q25,Admin!BN:BT,5,FALSE)*IF(N25=\"kL\",1000,1)*OFFSET(Admin!$AR$3,MATCH(\"GJ\",convSources,0),MATCH(K25,convTargets,0)),IF(OR(N25=\"Kg\",N25=\"Tonnes\"),VLOOKUP(\"F2-\"&Q25,Admin!BN:BT,6,FALSE)*IF(N25=\"Tonnes\",1000,1)*OFFSET(Admin!$AR$3,MATCH(\"GJ\",convSources,0),MATCH(K25,convTargets,0)),IF(N25=\"m3\",VLOOKUP(\"F2-\"&Q25,Admin!BN:BT,7,FALSE)*OFFSET(Admin!$AR$3,MATCH(\"Kg\",convSources,0),MATCH(K25,convTargets,0)),OFFSET(Admin!$AR$3,MATCH(N25,convSources,0),MATCH(K25,convTargets,0))))))","v":0},"MJ","Manual",null,"kL","NA",null,"Diesel",{"$f":"J25*OFFSET(Admin!$AR$3,MATCH(K25,convSources,0),MATCH(K$15,convTargets,0))","v":0}]
["T1","T1.3","T1","Biodiesel",1,null,null,"Biodiesel","Optional",{"$f":"IF(N26=\"NA\",_xlfn.VALUETOTEXT(M26),M26*IF(OR(N26=\"L\", N26=\"kL\"),VLOOKUP(\"T3-\"&Q26,Admin!BN:BT,5,FALSE)*IF(N26=\"kL\",1000,1)*OFFSET(Admin!$AR$3,MATCH(\"GJ\",convSources,0),MATCH(K26,convTargets,0)),IF(OR(N26=\"Kg\",N26=\"Tonnes\"),VLOOKUP(\"F2-\"&Q26,Admin!BN:BT,6,FALSE)*IF(N26=\"Tonnes\",1000,1)*OFFSET(Admin!$AR$3,MATCH(\"GJ\",convSources,0),MATCH(K26,convTargets,0)),IF(N26=\"m3\",VLOOKUP(\"F2-\"&Q26,Admin!BN:BT,7,FALSE)*OFFSET(Admin!$AR$3,MATCH(\"Kg\",convSources,0),MATCH(K26,convTargets,0)),OFFSET(Admin!$AR$3,MATCH(N26,convSources,0),MATCH(K26,convTargets,0))))))","v":0},"MJ","Segment Aggregation",{"$f":"SUMIF(C:C,B26,J:J)","v":0},"MJ","NA",null,"Biodiesel",{"$f":"J26*OFFSET(Admin!$AR$3,MATCH(K26,convSources,0),MATCH(K$15,convTargets,0))","v":0}]
["T1","T1.3.1","T1.3","BiodieselFRDSegmentSplitRoad vehicles",{"$f":"IFERROR(LEN(B27)-LEN(SUBSTITUTE(B27,\".\",\"\") ),\"BAD VALUE\")","v":2},"+ (add segment)",null,"Road vehicles","Optional",{"$f":"IF(N27=\"NA\",_xlfn.VALUETOTEXT(M27),M27*IF(OR(N27=\"L\", N27=\"kL\"),VLOOKUP(\"T3-\"&Q27,Admin!BN:BT,5,FALSE)*IF(N27=\"kL\",1000,1)*OFFSET(Admin!$AR$3,MATCH(\"GJ\",convSources,0),MATCH(K27,convTargets,0)),IF(OR(N27=\"Kg\",N27=\"Tonnes\"),VLOOKUP(\"F2-\"&Q27,Admin!BN:BT,6,FALSE)*IF(N27=\"Tonnes\",1000,1)*OFFSET(Admin!$AR$3,MATCH(\"GJ\",convSources,0),MATCH(K27,convTargets,0)),IF(N27=\"m3\",VLOOKUP(\"F2-\"&Q27,Admin!BN:BT,7,FALSE)*OFFSET(Admin!$AR$3,MATCH(\"Kg\",convSources,0),MATCH(K27,convTargets,0)),OFFSET(Admin!$AR$3,MATCH(N27,convSources,0),MATCH(K27,convTargets,0))))))","v":0},"MJ","Manual",null,"kL","NA",null,"Biodiesel",{"$f":"J27*OFFSET(Admin!$AR$3,MATCH(K27,convSources,0),MATCH(K$15,convTargets,0))","v":0}]
["T1","T1.3.2","T1.3","BiodieselFRDSegmentSplitNon-road vehicles",{"$f":"IFERROR(LEN(B28)-LEN(SUBSTITUTE(B28,\".\",\"\") ),\"BAD VALUE\")","v":2},"+ (add segment)",null,"Non-road vehicles","Optional",{"$f":"IF(N28=\"NA\",_xlfn.VALUETOTEXT(M28),M28*IF(OR(N28=\"L\", N28=\"kL\"),VLOOKUP(\"T3-\"&Q28,Admin!BN:BT,5,FALSE)*IF(N28=\"kL\",1000,1)*OFFSET(Admin!$AR$3,MATCH(\"GJ\",convSources,0),MATCH(K28,convTargets,0)),IF(OR(N28=\"Kg\",N28=\"Tonnes\"),VLOOKUP(\"F2-\"&Q28,Admin!BN:BT,6,FALSE)*IF(N28=\"Tonnes\",1000,1)*OFFSET(Admin!$AR$3,MATCH(\"GJ\",convSources,0),MATCH(K28,convTargets,0)),IF(N28=\"m3\",VLOOKUP(\"F2-\"&Q28,Admin!BN:BT,7,FALSE)*OFFSET(Admin!$AR$3,MATCH(\"Kg\",convSources,0),MATCH(K28,convTargets,0)),OFFSET(Admin!$AR$3,MATCH(N28,convSources,0),MATCH(K28,convTargets,0))))))","v":0},"MJ","Manual",null,"kL","NA",null,"Biodiesel",{"$f":"J28*OFFSET(Admin!$AR$3,MATCH(K28,convSources,0),MATCH(K$15,convTargets,0))","v":0}]
["T1","T1.4","T1","LPG",{"$f":"IFERROR(LEN(B29)-LEN(SUBSTITUTE(B29,\".\",\"\") ),\"BAD VALUE\")","v":1},null,null,"LPG","Optional",{"$f":"IF(N29=\"NA\",_xlfn.VALUETOTEXT(M29),M29*IF(OR(N29=\"L\", N29=\"kL\"),VLOOKUP(\"T3-\"&Q29,Admin!BN:BT,5,FALSE)*IF(N29=\"kL\",1000,1)*OFFSET(Admin!$AR$3,MATCH(\"GJ\",convSources,0),MATCH(K29,convTargets,0)),IF(OR(N29=\"Kg\",N29=\"Tonnes\"),VLOOKUP(\"F2-\"&Q29,Admin!BN:BT,6,FALSE)*IF(N29=\"Tonnes\",1000,1)*OFFSET(Admin!$AR$3,MATCH(\"GJ\",convSources,0),MATCH(K29,convTargets,0)),IF(N29=\"m3\",VLOOKUP(\"F2-\"&Q29,Admin!BN:BT,7,FALSE)*OFFSET(Admin!$AR$3,MATCH(\"Kg\",convSources,0),MATCH(K29,convTargets,0)),OFFSET(Admin!$AR$3,MATCH(N29,convSources,0),MATCH(K29,convTargets,0))))))","v":0},"MJ","Segment Aggregation",{"$f":"SUMIF(C:C,B29,J:J)","v":0},"MJ","NA",null,"LPG",{"$f":"J29*OFFSET(Admin!$AR$3,MATCH(K29,convSources,0),MATCH(K$15,convTargets,0))","v":0}]
["T1","T1.4.1","T1.4","LPGFRDSegmentSplitRoad vehicles",{"$f":"IFERROR(LEN(B30)-LEN(SUBSTITUTE(B30,\".\",\"\") ),\"BAD VALUE\")","v":2},"+ (add segment)",null,"Road vehicles","Optional",{"$f":"IF(N30=\"NA\",_xlfn.VALUETOTEXT(M30),M30*IF(OR(N30=\"L\", N30=\"kL\"),VLOOKUP(\"T3-\"&Q30,Admin!BN:BT,5,FALSE)*IF(N30=\"kL\",1000,1)*OFFSET(Admin!$AR$3,MATCH(\"GJ\",convSources,0),MATCH(K30,convTargets,0)),IF(OR(N30=\"Kg\",N30=\"Tonnes\"),VLOOKUP(\"F2-\"&Q30,Admin!BN:BT,6,FALSE)*IF(N30=\"Tonnes\",1000,1)*OFFSET(Admin!$AR$3,MATCH(\"GJ\",convSources,0),MATCH(K30,convTargets,0)),IF(N30=\"m3\",VLOOKUP(\"F2-\"&Q30,Admin!BN:BT,7,FALSE)*OFFSET(Admin!$AR$3,MATCH(\"Kg\",convSources,0),MATCH(K30,convTargets,0)),OFFSET(Admin!$AR$3,MATCH(N30,convSources,0),MATCH(K30,convTargets,0))))))","v":0},"MJ","Manual",null,"kL","NA",null,"LPG",{"$f":"J30*OFFSET(Admin!$AR$3,MATCH(K30,convSources,0),MATCH(K$15,convTargets,0))","v":0}]
["T1","T1.4.2","T1.4","LPGFRDSegmentSplitNon-road vehicles",{"$f":"IFERROR(LEN(B31)-LEN(SUBSTITUTE(B31,\".\",\"\") ),\"BAD VALUE\")","v":2},"+ (add segment)",null,"Non-road vehicles","Optional",{"$f":"IF(N31=\"NA\",_xlfn.VALUETOTEXT(M31),M31*IF(OR(N31=\"L\", N31=\"kL\"),VLOOKUP(\"T3-\"&Q31,Admin!BN:BT,5,FALSE)*IF(N31=\"kL\",1000,1)*OFFSET(Admin!$AR$3,MATCH(\"GJ\",convSources,0),MATCH(K31,convTargets,0)),IF(OR(N31=\"Kg\",N31=\"Tonnes\"),VLOOKUP(\"F2-\"&Q31,Admin!BN:BT,6,FALSE)*IF(N31=\"Tonnes\",1000,1)*OFFSET(Admin!$AR$3,MATCH(\"GJ\",convSources,0),MATCH(K31,convTargets,0)),IF(N31=\"m3\",VLOOKUP(\"F2-\"&Q31,Admin!BN:BT,7,FALSE)*OFFSET(Admin!$AR$3,MATCH(\"Kg\",convSources,0),MATCH(K31,convTargets,0)),OFFSET(Admin!$AR$3,MATCH(N31,convSources,0),MATCH(K31,convTargets,0))))))","v":0},"MJ","Manual",null,"kL","NA",null,"LPG",{"$f":"J31*OFFSET(Admin!$AR$3,MATCH(K31,convSources,0),MATCH(K$15,convTargets,0))","v":0}]
["T1","T1.5","T1","Aviation Fuels",{"$f":"IFERROR(LEN(B32)-LEN(SUBSTITUTE(B32,\".\",\"\") ),\"BAD VALUE\")","v":1},null,null,"Aviation Fuels","Optional",{"$f":"IF(N32=\"NA\",_xlfn.VALUETOTEXT(M32),M32*IF(OR(N32=\"L\", N32=\"kL\"),VLOOKUP(\"T3-\"&Q32,Admin!BN:BT,5,FALSE)*IF(N32=\"kL\",1000,1)*OFFSET(Admin!$AR$3,MATCH(\"GJ\",convSources,0),MATCH(K32,convTargets,0)),IF(OR(N32=\"Kg\",N32=\"Tonnes\"),VLOOKUP(\"F2-\"&Q32,Admin!BN:BT,6,FALSE)*IF(N32=\"Tonnes\",1000,1)*OFFSET(Admin!$AR$3,MATCH(\"GJ\",convSources,0),MATCH(K32,convTargets,0)),IF(N32=\"m3\",VLOOKUP(\"F2-\"&Q32,Admin!BN:BT,7,FALSE)*OFFSET(Admin!$AR$3,MATCH(\"Kg\",convSources,0),MATCH(K32,convTargets,0)),OFFSET(Admin!$AR$3,MATCH(N32,convSources,0),MATCH(K32,convTargets,0))))))","v":0},"MJ","Segment Aggregation",{"$f":"SUMIF(C:C,B32,J:J)","v":0},"MJ","NA",null,"Aviation Fuels",{"$f":"J32*OFFSET(Admin!$AR$3,MATCH(K32,convSources,0),MATCH(K$15,convTargets,0))","v":0}]
["T1","T1.5.1","T1.5","Aviation FuelsFRDSegmentSplitAvgas",{"$f":"IFERROR(LEN(B33)-LEN(SUBSTITUTE(B33,\".\",\"\") ),\"BAD VALUE\")","v":2},null,null,"Avgas","Optional",{"$f":"IF(N33=\"NA\",_xlfn.VALUETOTEXT(M33),M33*IF(OR(N33=\"L\", N33=\"kL\"),VLOOKUP(\"T3-\"&Q33,Admin!BN:BT,5,FALSE)*IF(N33=\"kL\",1000,1)*OFFSET(Admin!$AR$3,MATCH(\"GJ\",convSources,0),MATCH(K33,convTargets,0)),IF(OR(N33=\"Kg\",N33=\"Tonnes\"),VLOOKUP(\"F2-\"&Q33,Admin!BN:BT,6,FALSE)*IF(N33=\"Tonnes\",1000,1)*OFFSET(Admin!$AR$3,MATCH(\"GJ\",convSources,0),MATCH(K33,convTargets,0)),IF(N33=\"m3\",VLOOKUP(\"F2-\"&Q33,Admin!BN:BT,7,FALSE)*OFFSET(Admin!$AR$3,MATCH(\"Kg\",convSources,0),MATCH(K33,convTargets,0)),OFFSET(Admin!$AR$3,MATCH(N33,convSources,0),MATCH(K33,convTargets,0))))))","v":0},"MJ","Segment Aggregation",{"$f":"SUMIF(C:C,B33,J:J)","v":0},"MJ","NA",null,"Avgas",{"$f":"J33*OFFSET(Admin!$AR$3,MATCH(K33,convSources,0),MATCH(K$15,convTargets,0))","v":0}]
["T1","T1.5.1.1","T1.5.1","Aviation FuelsFRDSegmentSplitAvgasFRDSegmentSplitNon-road vehicles",{"$f":"IFERROR(LEN(B34)-LEN(SUBSTITUTE(B34,\".\",\"\") ),\"BAD VALUE\")","v":3},"+ (add segment)",null,"Non-road vehicles","Optional",{"$f":"IF(N34=\"NA\",_xlfn.VALUETOTEXT(M34),M34*IF(OR(N34=\"L\", N34=\"kL\"),VLOOKUP(\"T3-\"&Q34,Admin!BN:BT,5,FALSE)*IF(N34=\"kL\",1000,1)*OFFSET(Admin!$AR$3,MATCH(\"GJ\",convSources,0),MATCH(K34,convTargets,0)),IF(OR(N34=\"Kg\",N34=\"Tonnes\"),VLOOKUP(\"F2-\"&Q34,Admin!BN:BT,6,FALSE)*IF(N34=\"Tonnes\",1000,1)*OFFSET(Admin!$AR$3,MATCH(\"GJ\",convSources,0),MATCH(K34,convTargets,0)),IF(N34=\"m3\",VLOOKUP(\"F2-\"&Q34,Admin!BN:BT,7,FALSE)*OFFSET(Admin!$AR$3,MATCH(\"Kg\",convSources,0),MATCH(K34,convTargets,0)),OFFSET(Admin!$AR$3,MATCH(N34,convSources,0),MATCH(K34,convTargets,0))))))","v":0},"MJ","Manual",null,"kL","NA",null,"Avgas",{"$f":"J34*OFFSET(Admin!$AR$3,MATCH(K34,convSources,0),MATCH(K$15,convTargets,0))","v":0}]
["T1","T1.5.2","T1.5","Aviation FuelsFRDSegmentSplitAviation turbine fuel (ATF)",{"$f":"IFERROR(LEN(B35)-LEN(SUBSTITUTE(B35,\".\",\"\") ),\"BAD VALUE\")","v":2},null,null,"Aviation turbine fuel (ATF)","Optional",{"$f":"IF(N35=\"NA\",_xlfn.VALUETOTEXT(M35),M35*IF(OR(N35=\"L\", N35=\"kL\"),VLOOKUP(\"T3-\"&Q35,Admin!BN:BT,5,FALSE)*IF(N35=\"kL\",1000,1)*OFFSET(Admin!$AR$3,MATCH(\"GJ\",convSources,0),MATCH(K35,convTargets,0)),IF(OR(N35=\"Kg\",N35=\"Tonnes\"),VLOOKUP(\"F2-\"&Q35,Admin!BN:BT,6,FALSE)*IF(N35=\"Tonnes\",1000,1)*OFFSET(Admin!$AR$3,MATCH(\"GJ\",convSources,0),MATCH(K35,convTargets,0)),IF(N35=\"m3\",VLOOKUP(\"F2-\"&Q35,Admin!BN:BT,7,FALSE)*OFFSET(Admin!$AR$3,MATCH(\"Kg\",convSources,0),MATCH(K35,convTargets,0)),OFFSET(Admin!$AR$3,MATCH(N35,convSources,0),MATCH(K35,convTargets,0))))))","v":0},"MJ","Segment Aggregation",{"$f":"SUMIF(C:C,B35,J:J)","v":0},"MJ","NA",null,"Aviation turbine fuel (ATF)",{"$f":"J35*OFFSET(Admin!$AR$3,MATCH(K35,convSources,0),MATCH(K$15,convTargets,0))","v":0}]
["T1","T1.5.2.1","T1.5.2","Aviation FuelsFRDSegmentSplitAviation turbine fuel (ATF)FRDSegmentSplitNon-road vehicles",{"$f":"IFERROR(LEN(B36)-LEN(SUBSTITUTE(B36,\".\",\"\") ),\"BAD VALUE\")","v":3},"+ (add segment)",null,"Non-road vehicles","Optional",{"$f":"IF(N36=\"NA\",_xlfn.VALUETOTEXT(M36),M36*IF(OR(N36=\"L\", N36=\"kL\"),VLOOKUP(\"T3-\"&Q36,Admin!BN:BT,5,FALSE)*IF(N36=\"kL\",1000,1)*OFFSET(Admin!$AR$3,MATCH(\"GJ\",convSources,0),MATCH(K36,convTargets,0)),IF(OR(N36=\"Kg\",N36=\"Tonnes\"),VLOOKUP(\"F2-\"&Q36,Admin!BN:BT,6,FALSE)*IF(N36=\"Tonnes\",1000,1)*OFFSET(Admin!$AR$3,MATCH(\"GJ\",convSources,0),MATCH(K36,convTargets,0)),IF(N36=\"m3\",VLOOKUP(\"F2-\"&Q36,Admin!BN:BT,7,FALSE)*OFFSET(Admin!$AR$3,MATCH(\"Kg\",convSources,0),MATCH(K36,convTargets,0)),OFFSET(Admin!$AR$3,MATCH(N36,convSources,0),MATCH(K36,convTargets,0))))))","v":0},"MJ","Manual",null,"kL","NA",null,"Aviation turbine fuel (ATF)",{"$f":"J36*OFFSET(Admin!$AR$3,MATCH(K36,convSources,0),MATCH(K$15,convTargets,0))","v":0}]
["T1","T1.6","T1","Solid fuel",{"$f":"IFERROR(LEN(B37)-LEN(SUBSTITUTE(B37,\".\",\"\") ),\"BAD VALUE\")","v":1},null,null,"Solid fuel",{"$f":"IF(VLOOKUP(A37,TierIndicators,3,FALSE)=\"Yes\", \"Mandatory\", \"Optional\")","v":"Optional"},{"$f":"IF(N37=\"NA\",_xlfn.VALUETOTEXT(M37),M37*IF(OR(N37=\"L\", N37=\"kL\"),VLOOKUP(\"T3-\"&Q37,Admin!BN:BT,5,FALSE)*IF(N37=\"kL\",1000,1)*OFFSET(Admin!$AR$3,MATCH(\"GJ\",convSources,0),MATCH(K37,convTargets,0)),IF(OR(N37=\"Kg\",N37=\"Tonnes\"),VLOOKUP(\"F2-\"&Q37,Admin!BN:BT,6,FALSE)*IF(N37=\"Tonnes\",1000,1)*OFFSET(Admin!$AR$3,MATCH(\"GJ\",convSources,0),MATCH(K37,convTargets,0)),IF(N37=\"m3\",VLOOKUP(\"F2-\"&Q37,Admin!BN:BT,7,FALSE)*OFFSET(Admin!$AR$3,MATCH(\"Kg\",convSources,0),MATCH(K37,convTargets,0)),OFFSET(Admin!$AR$3,MATCH(N37,convSources,0),MATCH(K37,convTargets,0))))))","v":0},"MJ","Segment Aggregation",{"$f":"SUMIF(C:C,B37,J:J)","v":0},"MJ","NA",null,"Solid fuel",{"$f":"J37*OFFSET(Admin!$AR$3,MATCH(K37,convSources,0),MATCH(K$15,convTargets,0))","v":0}]
["T1","T1.6.1","T1.6","Solid fuelFRDSegmentSplitAnthracite coal",2,null,null,"Anthracite coal","Optional",{"$f":"IF(N38=\"NA\",_xlfn.VALUETOTEXT(M38),M38*IF(OR(N38=\"L\", N38=\"kL\"),VLOOKUP(\"T3-\"&Q38,Admin!BN:BT,5,FALSE)*IF(N38=\"kL\",1000,1)*OFFSET(Admin!$AR$3,MATCH(\"GJ\",convSources,0),MATCH(K38,convTargets,0)),IF(OR(N38=\"Kg\",N38=\"Tonnes\"),VLOOKUP(\"F2-\"&Q38,Admin!BN:BT,6,FALSE)*IF(N38=\"Tonnes\",1000,1)*OFFSET(Admin!$AR$3,MATCH(\"GJ\",convSources,0),MATCH(K38,convTargets,0)),IF(N38=\"m3\",VLOOKUP(\"F2-\"&Q38,Admin!BN:BT,7,FALSE)*OFFSET(Admin!$AR$3,MATCH(\"Kg\",convSources,0),MATCH(K38,convTargets,0)),OFFSET(Admin!$AR$3,MATCH(N38,convSources,0),MATCH(K38,convTargets,0))))))","v":0},"MJ","Segment Aggregation",{"$f":"SUMIF(C:C,B38,J:J)","v":0},"MJ","NA",null,"Anthracite coal",{"$f":"J38*OFFSET(Admin!$AR$3,MATCH(K38,convSources,0),MATCH(K$15,convTargets,0))","v":0}]
["T1","T1.6.1.1","T1.6.1","Solid fuelFRDSegmentSplitAnthracite coalFRDSegmentSplitRoad vehicles",3,"+ (add segment)",null,"Road vehicles","Optional",{"$f":"IF(N39=\"NA\",_xlfn.VALUETOTEXT(M39),M39*IF(OR(N39=\"L\", N39=\"kL\"),VLOOKUP(\"T3-\"&Q39,Admin!BN:BT,5,FALSE)*IF(N39=\"kL\",1000,1)*OFFSET(Admin!$AR$3,MATCH(\"GJ\",convSources,0),MATCH(K39,convTargets,0)),IF(OR(N39=\"Kg\",N39=\"Tonnes\"),VLOOKUP(\"F2-\"&Q39,Admin!BN:BT,6,FALSE)*IF(N39=\"Tonnes\",1000,1)*OFFSET(Admin!$AR$3,MATCH(\"GJ\",convSources,0),MATCH(K39,convTargets,0)),IF(N39=\"m3\",VLOOKUP(\"F2-\"&Q39,Admin!BN:BT,7,FALSE)*OFFSET(Admin!$AR$3,MATCH(\"Kg\",convSources,0),MATCH(K39,convTargets,0)),OFFSET(Admin!$AR$3,MATCH(N39,convSources,0),MATCH(K39,convTargets,0))))))","v":0},"MJ","Manual",null,"Kg","NA",null,"Anthracite coal",{"$f":"J39*OFFSET(Admin!$AR$3,MATCH(K39,convSources,0),MATCH(K$15,convTargets,0))","v":0}]
["T1","T1.6.1.2","T1.6.1","Solid fuelFRDSegmentSplitAnthracite coalFRDSegmentSplitNon-road vehicles",3,"+ (add segment)",null,"Non-road vehicles","Optional",{"$f":"IF(N40=\"NA\",_xlfn.VALUETOTEXT(M40),M40*IF(OR(N40=\"L\", N40=\"kL\"),VLOOKUP(\"T3-\"&Q40,Admin!BN:BT,5,FALSE)*IF(N40=\"kL\",1000,1)*OFFSET(Admin!$AR$3,MATCH(\"GJ\",convSources,0),MATCH(K40,convTargets,0)),IF(OR(N40=\"Kg\",N40=\"Tonnes\"),VLOOKUP(\"F2-\"&Q40,Admin!BN:BT,6,FALSE)*IF(N40=\"Tonnes\",1000,1)*OFFSET(Admin!$AR$3,MATCH(\"GJ\",convSources,0),MATCH(K40,convTargets,0)),IF(N40=\"m3\",VLOOKUP(\"F2-\"&Q40,Admin!BN:BT,7,FALSE)*OFFSET(Admin!$AR$3,MATCH(\"Kg\",convSources,0),MATCH(K40,convTargets,0)),OFFSET(Admin!$AR$3,MATCH(N40,convSources,0),MATCH(K40,convTargets,0))))))","v":0},"MJ","Manual",null,"Kg","NA",null,"Anthracite coal",{"$f":"J40*OFFSET(Admin!$AR$3,MATCH(K40,convSources,0),MATCH(K$15,convTargets,0))","v":0}]
["T1","T1.6.2","T1.6","Solid fuelFRDSegmentSplitBituminous coal",{"$f":"IFERROR(LEN(B41)-LEN(SUBSTITUTE(B41,\".\",\"\") ),\"BAD VALUE\")","v":2},null,null,"Bituminous coal","Optional",{"$f":"IF(N41=\"NA\",_xlfn.VALUETOTEXT(M41),M41*IF(OR(N41=\"L\", N41=\"kL\"),VLOOKUP(\"T3-\"&Q41,Admin!BN:BT,5,FALSE)*IF(N41=\"kL\",1000,1)*OFFSET(Admin!$AR$3,MATCH(\"GJ\",convSources,0),MATCH(K41,convTargets,0)),IF(OR(N41=\"Kg\",N41=\"Tonnes\"),VLOOKUP(\"F2-\"&Q41,Admin!BN:BT,6,FALSE)*IF(N41=\"Tonnes\",1000,1)*OFFSET(Admin!$AR$3,MATCH(\"GJ\",convSources,0),MATCH(K41,convTargets,0)),IF(N41=\"m3\",VLOOKUP(\"F2-\"&Q41,Admin!BN:BT,7,FALSE)*OFFSET(Admin!$AR$3,MATCH(\"Kg\",convSources,0),MATCH(K41,convTargets,0)),OFFSET(Admin!$AR$3,MATCH(N41,convSources,0),MATCH(K41,convTargets,0))))))","v":0},"MJ","Segment Aggregation",{"$f":"SUMIF(C:C,B41,J:J)","v":0},"MJ","NA",null,"Bituminous coal",{"$f":"J41*OFFSET(Admin!$AR$3,MATCH(K41,convSources,0),MATCH(K$15,convTargets,0))","v":0}]
["T1","T1.6.2.1","T1.6.2","Solid fuelFRDSegmentSplitBituminous coalFRDSegmentSplitRoad vehicles",3,"+ (add segment)",null,"Road vehicles","Optional",{"$f":"IF(N42=\"NA\",_xlfn.VALUETOTEXT(M42),M42*IF(OR(N42=\"L\", N42=\"kL\"),VLOOKUP(\"T3-\"&Q42,Admin!BN:BT,5,FALSE)*IF(N42=\"kL\",1000,1)*OFFSET(Admin!$AR$3,MATCH(\"GJ\",convSources,0),MATCH(K42,convTargets,0)),IF(OR(N42=\"Kg\",N42=\"Tonnes\"),VLOOKUP(\"F2-\"&Q42,Admin!BN:BT,6,FALSE)*IF(N42=\"Tonnes\",1000,1)*OFFSET(Admin!$AR$3,MATCH(\"GJ\",convSources,0),MATCH(K42,convTargets,0)),IF(N42=\"m3\",VLOOKUP(\"F2-\"&Q42,Admin!BN:BT,7,FALSE)*OFFSET(Admin!$AR$3,MATCH(\"Kg\",convSources,0),MATCH(K42,convTargets,0)),OFFSET(Admin!$AR$3,MATCH(N42,convSources,0),MATCH(K42,convTargets,0))))))","v":0},"MJ","Manual",null,"Kg","NA",null,"Bituminous coal",{"$f":"J42*OFFSET(Admin!$AR$3,MATCH(K42,convSources,0),MATCH(K$15,convTargets,0))","v":0}]
["T1","T1.6.2.2","T1.6.2","Solid fuelFRDSegmentSplitBituminous coalFRDSegmentSplitNon-road vehicles",3,"+ (add segment)",null,"Non-road vehicles","Optional",{"$f":"IF(N43=\"NA\",_xlfn.VALUETOTEXT(M43),M43*IF(OR(N43=\"L\", N43=\"kL\"),VLOOKUP(\"T3-\"&Q43,Admin!BN:BT,5,FALSE)*IF(N43=\"kL\",1000,1)*OFFSET(Admin!$AR$3,MATCH(\"GJ\",convSources,0),MATCH(K43,convTargets,0)),IF(OR(N43=\"Kg\",N43=\"Tonnes\"),VLOOKUP(\"F2-\"&Q43,Admin!BN:BT,6,FALSE)*IF(N43=\"Tonnes\",1000,1)*OFFSET(Admin!$AR$3,MATCH(\"GJ\",convSources,0),MATCH(K43,convTargets,0)),IF(N43=\"m3\",VLOOKUP(\"F2-\"&Q43,Admin!BN:BT,7,FALSE)*OFFSET(Admin!$AR$3,MATCH(\"Kg\",convSources,0),MATCH(K43,convTargets,0)),OFFSET(Admin!$AR$3,MATCH(N43,convSources,0),MATCH(K43,convTargets,0))))))","v":0},"MJ","Manual",null,"Kg","NA",null,"Bituminous coal",{"$f":"J43*OFFSET(Admin!$AR$3,MATCH(K43,convSources,0),MATCH(K$15,convTargets,0))","v":0}]
["T1","T1.6.3","T1.6","Solid fuelFRDSegmentSplitCoal briquettes",2,null,null,"Coal briquettes","Optional",{"$f":"IF(N44=\"NA\",_xlfn.VALUETOTEXT(M44),M44*IF(OR(N44=\"L\", N44=\"kL\"),VLOOKUP(\"T3-\"&Q44,Admin!BN:BT,5,FALSE)*IF(N44=\"kL\",1000,1)*OFFSET(Admin!$AR$3,MATCH(\"GJ\",convSources,0),MATCH(K44,convTargets,0)),IF(OR(N44=\"Kg\",N44=\"Tonnes\"),VLOOKUP(\"F2-\"&Q44,Admin!BN:BT,6,FALSE)*IF(N44=\"Tonnes\",1000,1)*OFFSET(Admin!$AR$3,MATCH(\"GJ\",convSources,0),MATCH(K44,convTargets,0)),IF(N44=\"m3\",VLOOKUP(\"F2-\"&Q44,Admin!BN:BT,7,FALSE)*OFFSET(Admin!$AR$3,MATCH(\"Kg\",convSources,0),MATCH(K44,convTargets,0)),OFFSET(Admin!$AR$3,MATCH(N44,convSources,0),MATCH(K44,convTargets,0))))))","v":0},"MJ","Segment Aggregation",{"$f":"SUMIF(C:C,B44,J:J)","v":0},"MJ","NA",null,"Coal Briquettes",{"$f":"J44*OFFSET(Admin!$AR$3,MATCH(K44,convSources,0),MATCH(K$15,convTargets,0))","v":0}]
["T1","T1.6.3.1","T1.6.3","Solid fuelFRDSegmentSplitCoal briquettesFRDSegmentSplitRoad vehicles",3,"+ (add segment)",null,"Road vehicles","Optional",{"$f":"IF(N45=\"NA\",_xlfn.VALUETOTEXT(M45),M45*IF(OR(N45=\"L\", N45=\"kL\"),VLOOKUP(\"T3-\"&Q45,Admin!BN:BT,5,FALSE)*IF(N45=\"kL\",1000,1)*OFFSET(Admin!$AR$3,MATCH(\"GJ\",convSources,0),MATCH(K45,convTargets,0)),IF(OR(N45=\"Kg\",N45=\"Tonnes\"),VLOOKUP(\"F2-\"&Q45,Admin!BN:BT,6,FALSE)*IF(N45=\"Tonnes\",1000,1)*OFFSET(Admin!$AR$3,MATCH(\"GJ\",convSources,0),MATCH(K45,convTargets,0)),IF(N45=\"m3\",VLOOKUP(\"F2-\"&Q45,Admin!BN:BT,7,FALSE)*OFFSET(Admin!$AR$3,MATCH(\"Kg\",convSources,0),MATCH(K45,convTargets,0)),OFFSET(Admin!$AR$3,MATCH(N45,convSources,0),MATCH(K45,convTargets,0))))))","v":0},"MJ","Manual",null,"Kg","NA",null,"Coal Briquettes",{"$f":"J45*OFFSET(Admin!$AR$3,MATCH(K45,convSources,0),MATCH(K$15,convTargets,0))","v":0}]
["T1","T1.6.3.2","T1.6.3","Solid fuelFRDSegmentSplitCoal briquettesFRDSegmentSplitNon-road vehicles",3,"+ (add segment)",null,"Non-road vehicles","Optional",{"$f":"IF(N46=\"NA\",_xlfn.VALUETOTEXT(M46),M46*IF(OR(N46=\"L\", N46=\"kL\"),VLOOKUP(\"T3-\"&Q46,Admin!BN:BT,5,FALSE)*IF(N46=\"kL\",1000,1)*OFFSET(Admin!$AR$3,MATCH(\"GJ\",convSources,0),MATCH(K46,convTargets,0)),IF(OR(N46=\"Kg\",N46=\"Tonnes\"),VLOOKUP(\"F2-\"&Q46,Admin!BN:BT,6,FALSE)*IF(N46=\"Tonnes\",1000,1)*OFFSET(Admin!$AR$3,MATCH(\"GJ\",convSources,0),MATCH(K46,convTargets,0)),IF(N46=\"m3\",VLOOKUP(\"F2-\"&Q46,Admin!BN:BT,7,FALSE)*OFFSET(Admin!$AR$3,MATCH(\"Kg\",convSources,0),MATCH(K46,convTargets,0)),OFFSET(Admin!$AR$3,MATCH(N46,convSources,0),MATCH(K46,convTargets,0))))))","v":0},"MJ","Manual",null,"Kg","NA",null,"Coal Briquettes",{"$f":"J46*OFFSET(Admin!$AR$3,MATCH(K46,convSources,0),MATCH(K$15,convTargets,0))","v":0}]
["T1","T1.7","T1","Hydrogen",1,null,null,"Hydrogen","Optional",{"$f":"IF(N47=\"NA\",_xlfn.VALUETOTEXT(M47),M47*IF(OR(N47=\"L\", N47=\"kL\"),VLOOKUP(\"T3-\"&Q47,Admin!BN:BT,5,FALSE)*IF(N47=\"kL\",1000,1)*OFFSET(Admin!$AR$3,MATCH(\"GJ\",convSources,0),MATCH(K47,convTargets,0)),IF(OR(N47=\"Kg\",N47=\"Tonnes\"),VLOOKUP(\"F2-\"&Q47,Admin!BN:BT,6,FALSE)*IF(N47=\"Tonnes\",1000,1)*OFFSET(Admin!$AR$3,MATCH(\"GJ\",convSources,0),MATCH(K47,convTargets,0)),IF(N47=\"m3\",VLOOKUP(\"F2-\"&Q47,Admin!BN:BT,7,FALSE)*OFFSET(Admin!$AR$3,MATCH(\"Kg\",convSources,0),MATCH(K47,convTargets,0)),OFFSET(Admin!$AR$3,MATCH(N47,convSources,0),MATCH(K47,convTargets,0))))))","v":0},"MJ","Segment Aggregation",{"$f":"SUMIF(C:C,B47,J:J)","v":0},"MJ","NA",null,"Hydrogen",{"$f":"J47*OFFSET(Admin!$AR$3,MATCH(K47,convSources,0),MATCH(K$15,convTargets,0))","v":0}]
["T1","T1.7.1","T1.7","HydrogenFRDSegmentSplitRoad vehicles",{"$f":"IFERROR(LEN(B48)-LEN(SUBSTITUTE(B48,\".\",\"\") ),\"BAD VALUE\")","v":2},"+ (add segment)",null,"Road vehicles","Optional",{"$f":"IF(N48=\"NA\",_xlfn.VALUETOTEXT(M48),M48*IF(OR(N48=\"L\", N48=\"kL\"),VLOOKUP(\"T3-\"&Q48,Admin!BN:BT,5,FALSE)*IF(N48=\"kL\",1000,1)*OFFSET(Admin!$AR$3,MATCH(\"MJ\",convSources,0),MATCH(K48,convTargets,0)),IF(OR(N48=\"Kg\",N48=\"Tonnes\"),VLOOKUP(\"F2-\"&Q48,Admin!BN:BT,6,FALSE)*IF(N48=\"Tonnes\",1000,1)*OFFSET(Admin!$AR$3,MATCH(\"MJ\",convSources,0),MATCH(K48,convTargets,0)),IF(N48=\"m3\",VLOOKUP(\"F2-\"&Q48,Admin!BN:BT,7,FALSE)*OFFSET(Admin!$AR$3,MATCH(\"Kg\",convSources,0),MATCH(K48,convTargets,0)),OFFSET(Admin!$AR$3,MATCH(N48,convSources,0),MATCH(K48,convTargets,0))))))","v":0},"MJ","Manual",null,"Kg","NA",null,"Hydrogen",{"$f":"J48*OFFSET(Admin!$AR$3,MATCH(K48,convSources,0),MATCH(K$15,convTargets,0))","v":0}]
["T1","T1.7.2","T1.7","HydrogenFRDSegmentSplitNon-road vehicles",{"$f":"IFERROR(LEN(B49)-LEN(SUBSTITUTE(B49,\".\",\"\") ),\"BAD VALUE\")","v":2},"+ (add segment)",null,"Non-road vehicles","Optional",{"$f":"IF(N49=\"NA\",_xlfn.VALUETOTEXT(M49),M49*IF(OR(N49=\"L\", N49=\"kL\"),VLOOKUP(\"T3-\"&Q49,Admin!BN:BT,5,FALSE)*IF(N49=\"kL\",1000,1)*OFFSET(Admin!$AR$3,MATCH(\"MJ\",convSources,0),MATCH(K49,convTargets,0)),IF(OR(N49=\"Kg\",N49=\"Tonnes\"),VLOOKUP(\"F2-\"&Q49,Admin!BN:BT,6,FALSE)*IF(N49=\"Tonnes\",1000,1)*OFFSET(Admin!$AR$3,MATCH(\"MJ\",convSources,0),MATCH(K49,convTargets,0)),IF(N49=\"m3\",VLOOKUP(\"F2-\"&Q49,Admin!BN:BT,7,FALSE)*OFFSET(Admin!$AR$3,MATCH(\"Kg\",convSources,0),MATCH(K49,convTargets,0)),OFFSET(Admin!$AR$3,MATCH(N49,convSources,0),MATCH(K49,convTargets,0))))))","v":0},"MJ","Manual",null,"Kg","NA",null,"Hydrogen",{"$f":"J49*OFFSET(Admin!$AR$3,MATCH(K49,convSources,0),MATCH(K$15,convTargets,0))","v":0}]
["T1","T1.8","T1","Electricity",1,null,null,"Electricity","Optional",{"$f":"IF(N50=\"NA\",_xlfn.VALUETOTEXT(M50),M50*IF(OR(N50=\"L\", N50=\"kL\"),VLOOKUP(\"T3-\"&Q50,Admin!BN:BT,5,FALSE)*IF(N50=\"kL\",1000,1)*OFFSET(Admin!$AR$3,MATCH(\"GJ\",convSources,0),MATCH(K50,convTargets,0)),IF(OR(N50=\"Kg\",N50=\"Tonnes\"),VLOOKUP(\"F2-\"&Q50,Admin!BN:BT,6,FALSE)*IF(N50=\"Tonnes\",1000,1)*OFFSET(Admin!$AR$3,MATCH(\"GJ\",convSources,0),MATCH(K50,convTargets,0)),IF(N50=\"m3\",VLOOKUP(\"F2-\"&Q50,Admin!BN:BT,7,FALSE)*OFFSET(Admin!$AR$3,MATCH(\"Kg\",convSources,0),MATCH(K50,convTargets,0)),OFFSET(Admin!$AR$3,MATCH(N50,convSources,0),MATCH(K50,convTargets,0))))))","v":0},"MWh","Segment Aggregation",{"$f":"SUMIF(C:C,B50,J:J)","v":0},"MWh","NA",null,"Electricity",{"$f":"J50*OFFSET(Admin!$AR$3,MATCH(K50,convSources,0),MATCH(K$15,convTargets,0))","v":0}]
["T1","T1.8.1","T1.8","ElectricityFRDSegmentSplitused at Victorian Government facilities",2,null,null,"used at Victorian Government facilities","Optional",{"$f":"IF(N51=\"NA\",_xlfn.VALUETOTEXT(M51),M51*IF(OR(N51=\"L\", N51=\"kL\"),VLOOKUP(\"T3-\"&Q51,Admin!BN:BT,5,FALSE)*IF(N51=\"kL\",1000,1)*OFFSET(Admin!$AR$3,MATCH(\"GJ\",convSources,0),MATCH(K51,convTargets,0)),IF(OR(N51=\"Kg\",N51=\"Tonnes\"),VLOOKUP(\"F2-\"&Q51,Admin!BN:BT,6,FALSE)*IF(N51=\"Tonnes\",1000,1)*OFFSET(Admin!$AR$3,MATCH(\"GJ\",convSources,0),MATCH(K51,convTargets,0)),IF(N51=\"m3\",VLOOKUP(\"F2-\"&Q51,Admin!BN:BT,7,FALSE)*OFFSET(Admin!$AR$3,MATCH(\"Kg\",convSources,0),MATCH(K51,convTargets,0)),OFFSET(Admin!$AR$3,MATCH(N51,convSources,0),MATCH(K51,convTargets,0))))))","v":0},"MWh","Segment Aggregation",{"$f":"SUMIF(C:C,B51,J:J)","v":0},"MWh","NA",null,"used at Victorian Government facilities",{"$f":"J51*OFFSET(Admin!$AR$3,MATCH(K51,convSources,0),MATCH(K$15,convTargets,0))","v":0}]
["T1","T1.8.1.1","T1.8.1","ElectricityFRDSegmentSplitused at Victorian Government facilitiesFRDSegmentSplitRoad vehicles",{"$f":"IFERROR(LEN(B52)-LEN(SUBSTITUTE(B52,\".\",\"\") ),\"BAD VALUE\")","v":3},"+ (add segment)",null,"Road vehicles","Optional",{"$f":"IF(N52=\"NA\",_xlfn.VALUETOTEXT(M52),M52*IF(OR(N52=\"L\", N52=\"kL\"),VLOOKUP(\"T3-\"&Q52,Admin!BN:BT,5,FALSE)*IF(N52=\"kL\",1000,1)*OFFSET(Admin!$AR$3,MATCH(\"GJ\",convSources,0),MATCH(K52,convTargets,0)),IF(OR(N52=\"Kg\",N52=\"Tonnes\"),VLOOKUP(\"F2-\"&Q52,Admin!BN:BT,6,FALSE)*IF(N52=\"Tonnes\",1000,1)*OFFSET(Admin!$AR$3,MATCH(\"GJ\",convSources,0),MATCH(K52,convTargets,0)),IF(N52=\"m3\",VLOOKUP(\"F2-\"&Q52,Admin!BN:BT,7,FALSE)*OFFSET(Admin!$AR$3,MATCH(\"Kg\",convSources,0),MATCH(K52,convTargets,0)),OFFSET(Admin!$AR$3,MATCH(N52,convSources,0),MATCH(K52,convTargets,0))))))","v":0},"MWh","Manual",null,"MWh","NA",null,"Electricity",{"$f":"J52*OFFSET(Admin!$AR$3,MATCH(K52,convSources,0),MATCH(K$15,convTargets,0))","v":0}]
["T1","T1.8.1.2","T1.8.1","ElectricityFRDSegmentSplitused at Victorian Government facilitiesFRDSegmentSplitNon-road vehicles",{"$f":"IFERROR(LEN(B53)-LEN(SUBSTITUTE(B53,\".\",\"\") ),\"BAD VALUE\")","v":3},"+ (add segment)",null,"Non-road vehicles","Optional",{"$f":"IF(N53=\"NA\",_xlfn.VALUETOTEXT(M53),M53*IF(OR(N53=\"L\", N53=\"kL\"),VLOOKUP(\"T3-\"&Q53,Admin!BN:BT,5,FALSE)*IF(N53=\"kL\",1000,1)*OFFSET(Admin!$AR$3,MATCH(\"GJ\",convSources,0),MATCH(K53,convTargets,0)),IF(OR(N53=\"Kg\",N53=\"Tonnes\"),VLOOKUP(\"F2-\"&Q53,Admin!BN:BT,6,FALSE)*IF(N53=\"Tonnes\",1000,1)*OFFSET(Admin!$AR$3,MATCH(\"GJ\",convSources,0),MATCH(K53,convTargets,0)),IF(N53=\"m3\",VLOOKUP(\"F2-\"&Q53,Admin!BN:BT,7,FALSE)*OFFSET(Admin!$AR$3,MATCH(\"Kg\",convSources,0),MATCH(K53,convTargets,0)),OFFSET(Admin!$AR$3,MATCH(N53,convSources,0),MATCH(K53,convTargets,0))))))","v":0},"MWh","Manual",null,"MWh","NA",null,"Electricity",{"$f":"J53*OFFSET(Admin!$AR$3,MATCH(K53,convSources,0),MATCH(K$15,convTargets,0))","v":0}]
["T1","T1.8.2","T1.8","ElectricityFRDSegmentSplitused from other public or private chargers",{"$f":"IFERROR(LEN(B54)-LEN(SUBSTITUTE(B54,\".\",\"\") ),\"BAD VALUE\")","v":2},null,null,"used from other public or private chargers","Optional",{"$f":"IF(N54=\"NA\",_xlfn.VALUETOTEXT(M54),M54*IF(OR(N54=\"L\", N54=\"kL\"),VLOOKUP(\"T3-\"&Q54,Admin!BN:BT,5,FALSE)*IF(N54=\"kL\",1000,1)*OFFSET(Admin!$AR$3,MATCH(\"GJ\",convSources,0),MATCH(K54,convTargets,0)),IF(OR(N54=\"Kg\",N54=\"Tonnes\"),VLOOKUP(\"F2-\"&Q54,Admin!BN:BT,6,FALSE)*IF(N54=\"Tonnes\",1000,1)*OFFSET(Admin!$AR$3,MATCH(\"GJ\",convSources,0),MATCH(K54,convTargets,0)),IF(N54=\"m3\",VLOOKUP(\"F2-\"&Q54,Admin!BN:BT,7,FALSE)*OFFSET(Admin!$AR$3,MATCH(\"Kg\",convSources,0),MATCH(K54,convTargets,0)),OFFSET(Admin!$AR$3,MATCH(N54,convSources,0),MATCH(K54,convTargets,0))))))","v":0},"MWh","Segment Aggregation",{"$f":"SUMIF(C:C,B54,J:J)","v":0},"MWh","NA",null,"used from other public or private chargers",{"$f":"J54*OFFSET(Admin!$AR$3,MATCH(K54,convSources,0),MATCH(K$15,convTargets,0))","v":0}]
["T1","T1.8.2.1","T1.8.2","ElectricityFRDSegmentSplitused from other public or private chargersFRDSegmentSplitRoad vehicles",{"$f":"IFERROR(LEN(B55)-LEN(SUBSTITUTE(B55,\".\",\"\") ),\"BAD VALUE\")","v":3},"+ (add segment)",null,"Road vehicles","Optional",{"$f":"IF(N55=\"NA\",_xlfn.VALUETOTEXT(M55),M55*IF(OR(N55=\"L\", N55=\"kL\"),VLOOKUP(\"T3-\"&Q55,Admin!BN:BT,5,FALSE)*IF(N55=\"kL\",1000,1)*OFFSET(Admin!$AR$3,MATCH(\"GJ\",convSources,0),MATCH(K55,convTargets,0)),IF(OR(N55=\"Kg\",N55=\"Tonnes\"),VLOOKUP(\"F2-\"&Q55,Admin!BN:BT,6,FALSE)*IF(N55=\"Tonnes\",1000,1)*OFFSET(Admin!$AR$3,MATCH(\"GJ\",convSources,0),MATCH(K55,convTargets,0)),IF(N55=\"m3\",VLOOKUP(\"F2-\"&Q55,Admin!BN:BT,7,FALSE)*OFFSET(Admin!$AR$3,MATCH(\"Kg\",convSources,0),MATCH(K55,convTargets,0)),OFFSET(Admin!$AR$3,MATCH(N55,convSources,0),MATCH(K55,convTargets,0))))))","v":0},"MWh","Manual",null,"MWh","NA",null,"Electricity",{"$f":"J55*OFFSET(Admin!$AR$3,MATCH(K55,convSources,0),MATCH(K$15,convTargets,0))","v":0}]
["T1","T1.8.2.2","T1.8.2","ElectricityFRDSegmentSplitused from other public or private chargersFRDSegmentSplitNon-road vehicles",{"$f":"IFERROR(LEN(B56)-LEN(SUBSTITUTE(B56,\".\",\"\") ),\"BAD VALUE\")","v":3},"+ (add segment)",null,"Non-road vehicles","Optional",{"$f":"IF(N56=\"NA\",_xlfn.VALUETOTEXT(M56),M56*IF(OR(N56=\"L\", N56=\"kL\"),VLOOKUP(\"T3-\"&Q56,Admin!BN:BT,5,FALSE)*IF(N56=\"kL\",1000,1)*OFFSET(Admin!$AR$3,MATCH(\"GJ\",convSources,0),MATCH(K56,convTargets,0)),IF(OR(N56=\"Kg\",N56=\"Tonnes\"),VLOOKUP(\"F2-\"&Q56,Admin!BN:BT,6,FALSE)*IF(N56=\"Tonnes\",1000,1)*OFFSET(Admin!$AR$3,MATCH(\"GJ\",convSources,0),MATCH(K56,convTargets,0)),IF(N56=\"m3\",VLOOKUP(\"F2-\"&Q56,Admin!BN:BT,7,FALSE)*OFFSET(Admin!$AR$3,MATCH(\"Kg\",convSources,0),MATCH(K56,convTargets,0)),OFFSET(Admin!$AR$3,MATCH(N56,convSources,0),MATCH(K56,convTargets,0))))))","v":0},"MWh","Manual",null,"MWh","NA",null,"Electricity",{"$f":"J56*OFFSET(Admin!$AR$3,MATCH(K56,convSources,0),MATCH(K$15,convTargets,0))","v":0}]
[]
[]
[null,"T2","Number and proportion of vehicles in the organisational boundary segmented by engine/fuel type and vehicle category"]
[null,"ID","Parent ID","FRDSegment","Segment Level",null,null,"Description","Flag","Final Value","Final Unit","Input Type","Input Value","Input Unit"]
["T2","T2","NA",{"$f":"IF(E61=1,H61,IFERROR(VLOOKUP(C61,$B$14:$D$1048576,3,FALSE)&\"FRDSegmentSplit\"&H61,H61))","v":"Number of vehicles segmented by engine/fuel type and vehicle category"},{"$f":"IFERROR(LEN(B61)-LEN(SUBSTITUTE(B61,\".\",\"\") ),\"BAD VALUE\")","v":0},null,null,"Number of vehicles segmented by engine/fuel type and vehicle category",{"$f":"IF(VLOOKUP(A61,TierIndicators,3,FALSE)=\"Yes\", \"Mandatory\", \"Optional\")","v":"Optional"},{"$f":"M61","v":0},"qty","Segment Aggregation",{"$f":"SUMIF(C:C,B61,J:J)","v":0},"qty",{"$f":"IF(OR(L61=\"Segment Aggregation\",L61=\"Auto-Calc\"),\"NA\",IF(AND(I61=\"Mandatory\",OR(M61=\"\",N61=\"\")), \"FAIL\", IF(I61=\"Optional\",\"NA\",\"PASS\")))","v":"NA"},null,"Number of vehicles segmented by engine/fuel type and vehicle category"]
["T2","T2.1","T2","Internal Combustion Engines (where combusting fuel is used to drive pistons, turbines, rotors etc.)",1,null,null,"Internal Combustion Engines (where combusting fuel is used to drive pistons, turbines, rotors etc.)","Optional",{"$f":"M62","v":0},"qty","Segment Aggregation",{"$f":"SUMIF(C:C,B62,J:J)","v":0},"qty","NA",null,"Internal Combustion Engines (where combusting fuel is used to drive pistons, turbines, rotors etc.)"]
["T2","T2.1.1","T2.1","Internal Combustion Engines (where combusting fuel is used to drive pistons, turbines, rotors etc.)FRDSegmentSplitPetrol",2,null,null,"Petrol","Optional",{"$f":"M63","v":0},"qty","Segment Aggregation",{"$f":"SUMIF(C:C,B63,J:J)","v":0},"qty","NA",null,"Petrol"]
["T2","T2.1.1.1","T2.1.1","Internal Combustion Engines (where combusting fuel is used to drive pistons, turbines, rotors etc.)FRDSegmentSplitPetrolFRDSegmentSplitRoad vehicles",3,null,null,"Road vehicles",{"$f":"IF(VLOOKUP(A64,TierIndicators,3,FALSE)=\"Yes\", \"Mandatory\", \"Optional\")","v":"Optional"},{"$f":"M64","v":0},"qty","Segment Aggregation",{"$f":"SUMIF(C:C,B64,J:J)","v":0},"qty","NA",null,"Petrol"]
["T2","T2.1.1.1.1","T2.1.1.1","Internal Combustion Engines (where combusting fuel is used to drive pistons, turbines, rotors etc.)FRDSegmentSplitPetrolFRDSegmentSplitRoad vehiclesFRDSegmentSplitTwo-wheeled and three-wheeled vehicles",4,"+ (add segment)",null,"Two-wheeled and three-wheeled vehicles",{"$f":"IF(VLOOKUP(A65,TierIndicators,3,FALSE)=\"Yes\", \"Mandatory\", \"Optional\")","v":"Optional"},{"$f":"M65","v":0},"qty","Manual",null,"qty","NA",null,"Petrol"]
["T2","T2.1.1.1.2","T2.1.1.1","Internal Combustion Engines (where combusting fuel is used to drive pistons, turbines, rotors etc.)FRDSegmentSplitPetrolFRDSegmentSplitRoad vehiclesFRDSegmentSplitPassenger vehicles",4,"+ (add segment)",null,"Passenger vehicles",{"$f":"IF(VLOOKUP(A66,TierIndicators,3,FALSE)=\"Yes\", \"Mandatory\", \"Optional\")","v":"Optional"},{"$f":"M66","v":0},"qty","Manual",null,"qty","NA",null,"Petrol"]
["T2","T2.1.1.1.3","T2.1.1.1","Internal Combustion Engines (where combusting fuel is used to drive pistons, turbines, rotors etc.)FRDSegmentSplitPetrolFRDSegmentSplitRoad vehiclesFRDSegmentSplitBuses",4,"+ (add segment)",null,"Buses",{"$f":"IF(VLOOKUP(A67,TierIndicators,3,FALSE)=\"Yes\", \"Mandatory\", \"Optional\")","v":"Optional"},{"$f":"M67","v":0},"qty","Manual",null,"qty","NA",null,"Petrol"]
["T2","T2.1.1.1.4","T2.1.1.1","Internal Combustion Engines (where combusting fuel is used to drive pistons, turbines, rotors etc.)FRDSegmentSplitPetrolFRDSegmentSplitRoad vehiclesFRDSegmentSplitGoods vehicles",4,"+ (add segment)",null,"Goods vehicles",{"$f":"IF(VLOOKUP(A68,TierIndicators,3,FALSE)=\"Yes\", \"Mandatory\", \"Optional\")","v":"Optional"},{"$f":"M68","v":0},"qty","Manual",null,"qty","NA",null,"Petrol"]
["T2","T2.1.1.2","T2.1.1","Internal Combustion Engines (where combusting fuel is used to drive pistons, turbines, rotors etc.)FRDSegmentSplitPetrolFRDSegmentSplitNon-road vehicles",3,null,null,"Non-road vehicles",{"$f":"IF(VLOOKUP(A69,TierIndicators,3,FALSE)=\"Yes\", \"Mandatory\", \"Optional\")","v":"Optional"},{"$f":"M69","v":0},"qty","Segment Aggregation",{"$f":"SUMIF(C:C,B69,J:J)","v":0},"qty","NA",null,"Petrol"]
["T2","T2.1.1.2.1","T2.1.1.2","Internal Combustion Engines (where combusting fuel is used to drive pistons, turbines, rotors etc.)FRDSegmentSplitPetrolFRDSegmentSplitNon-road vehiclesFRDSegmentSplitHeavy rail locomotives",4,"+ (add segment)",null,"Heavy rail locomotives",{"$f":"IF(VLOOKUP(A70,TierIndicators,3,FALSE)=\"Yes\", \"Mandatory\", \"Optional\")","v":"Optional"},{"$f":"M70","v":0},"qty","Manual",null,"qty","NA",null,"Petrol"]
["T2","T2.1.1.2.2","T2.1.1.2","Internal Combustion Engines (where combusting fuel is used to drive pistons, turbines, rotors etc.)FRDSegmentSplitPetrolFRDSegmentSplitNon-road vehiclesFRDSegmentSplitLight rail vehicles",4,"+ (add segment)",null,"Light rail vehicles",{"$f":"IF(VLOOKUP(A71,TierIndicators,3,FALSE)=\"Yes\", \"Mandatory\", \"Optional\")","v":"Optional"},{"$f":"M71","v":0},"qty","Manual",null,"qty","NA",null,"Petrol"]
["T2","T2.1.1.2.3","T2.1.1.2","Internal Combustion Engines (where combusting fuel is used to drive pistons, turbines, rotors etc.)FRDSegmentSplitPetrolFRDSegmentSplitNon-road vehiclesFRDSegmentSplitMarine vessels",4,"+ (add segment)",null,"Marine vessels",{"$f":"IF(VLOOKUP(A72,TierIndicators,3,FALSE)=\"Yes\", \"Mandatory\", \"Optional\")","v":"Optional"},{"$f":"M72","v":0},"qty","Manual",null,"qty","NA",null,"Petrol"]
["T2","T2.1.1.2.4","T2.1.1.2","Internal Combustion Engines (where combusting fuel is used to drive pistons, turbines, rotors etc.)FRDSegmentSplitPetrolFRDSegmentSplitNon-road vehiclesFRDSegmentSplitRotary wing aircraft",4,"+ (add segment)",null,"Rotary wing aircraft",{"$f":"IF(VLOOKUP(A73,TierIndicators,3,FALSE)=\"Yes\", \"Mandatory\", \"Optional\")","v":"Optional"},{"$f":"M73","v":0},"qty","Manual",null,"qty","NA",null,"Petrol"]
["T2","T2.1.1.2.5","T2.1.1.2","Internal Combustion Engines (where combusting fuel is used to drive pistons, turbines, rotors etc.)FRDSegmentSplitPetrolFRDSegmentSplitNon-road vehiclesFRDSegmentSplitFixed wing aircraft",4,"+ (add segment)",null,"Fixed wing aircraft",{"$f":"IF(VLOOKUP(A74,TierIndicators,3,FALSE)=\"Yes\", \"Mandatory\", \"Optional\")","v":"Optional"},{"$f":"M74","v":0},"qty","Manual",null,"qty","NA",null,"Petrol"]
["T2","T2.1.1.2.6","T2.1.1.2","Internal Combustion Engines (where combusting fuel is used to drive pistons, turbines, rotors etc.)FRDSegmentSplitPetrolFRDSegmentSplitNon-road vehiclesFRDSegmentSplitOther non-road vehicles",4,"+ (add segment)",null,"Other non-road vehicles",{"$f":"IF(VLOOKUP(A75,TierIndicators,3,FALSE)=\"Yes\", \"Mandatory\", \"Optional\")","v":"Optional"},{"$f":"M75","v":0},"qty","Manual",null,"qty","NA",null,"Petrol"]
["T2","T2.1.2","T2.1","Internal Combustion Engines (where combusting fuel is used to drive pistons, turbines, rotors etc.)FRDSegmentSplitDiesel/Biodiesel",{"$f":"IFERROR(LEN(B76)-LEN(SUBSTITUTE(B76,\".\",\"\") ),\"BAD VALUE\")","v":2},null,null,"Diesel/Biodiesel","Optional",0,"qty","Segment Aggregation",{"$f":"SUMIF(C:C,B76,J:J)","v":0},"qty","NA",null,"Diesel/Biodiesel"]
["T2","T2.1.2.1","T2.1.2","Internal Combustion Engines (where combusting fuel is used to drive pistons, turbines, rotors etc.)FRDSegmentSplitDiesel/BiodieselFRDSegmentSplitRoad vehicles",{"$f":"IFERROR(LEN(B77)-LEN(SUBSTITUTE(B77,\".\",\"\") ),\"BAD VALUE\")","v":3},null,null,"Road vehicles",{"$f":"IF(VLOOKUP(A77,TierIndicators,3,FALSE)=\"Yes\", \"Mandatory\", \"Optional\")","v":"Optional"},{"$f":"M77","v":0},"qty","Segment Aggregation",{"$f":"SUMIF(C:C,B77,J:J)","v":0},"qty","NA",null,"Diesel/Biodiesel"]
["T2","T2.1.2.1.1","T2.1.2.1","Internal Combustion Engines (where combusting fuel is used to drive pistons, turbines, rotors etc.)FRDSegmentSplitDiesel/BiodieselFRDSegmentSplitRoad vehiclesFRDSegmentSplitTwo-wheeled and three-wheeled vehicles",{"$f":"IFERROR(LEN(B78)-LEN(SUBSTITUTE(B78,\".\",\"\") ),\"BAD VALUE\")","v":4},"+ (add segment)",null,"Two-wheeled and three-wheeled vehicles",{"$f":"IF(VLOOKUP(A78,TierIndicators,3,FALSE)=\"Yes\", \"Mandatory\", \"Optional\")","v":"Optional"},{"$f":"M78","v":0},"qty","Manual",null,"qty","NA",null,"Diesel/Biodiesel"]
["T2","T2.1.2.1.2","T2.1.2.1","Internal Combustion Engines (where combusting fuel is used to drive pistons, turbines, rotors etc.)FRDSegmentSplitDiesel/BiodieselFRDSegmentSplitRoad vehiclesFRDSegmentSplitPassenger vehicles",{"$f":"IFERROR(LEN(B79)-LEN(SUBSTITUTE(B79,\".\",\"\") ),\"BAD VALUE\")","v":4},"+ (add segment)",null,"Passenger vehicles",{"$f":"IF(VLOOKUP(A79,TierIndicators,3,FALSE)=\"Yes\", \"Mandatory\", \"Optional\")","v":"Optional"},{"$f":"M79","v":0},"qty","Manual",null,"qty","NA",null,"Diesel/Biodiesel"]
["T2","T2.1.2.1.3","T2.1.2.1","Internal Combustion Engines (where combusting fuel is used to drive pistons, turbines, rotors etc.)FRDSegmentSplitDiesel/BiodieselFRDSegmentSplitRoad vehiclesFRDSegmentSplitBuses",{"$f":"IFERROR(LEN(B80)-LEN(SUBSTITUTE(B80,\".\",\"\") ),\"BAD VALUE\")","v":4},"+ (add segment)",null,"Buses",{"$f":"IF(VLOOKUP(A80,TierIndicators,3,FALSE)=\"Yes\", \"Mandatory\", \"Optional\")","v":"Optional"},{"$f":"M80","v":0},"qty","Manual",null,"qty","NA",null,"Diesel/Biodiesel"]
["T2","T2.1.2.1.4","T2.1.2.1","Internal Combustion Engines (where combusting fuel is used to drive pistons, turbines, rotors etc.)FRDSegmentSplitDiesel/BiodieselFRDSegmentSplitRoad vehiclesFRDSegmentSplitGoods vehicles",{"$f":"IFERROR(LEN(B81)-LEN(SUBSTITUTE(B81,\".\",\"\") ),\"BAD VALUE\")","v":4},"+ (add segment)",null,"Goods vehicles",{"$f":"IF(VLOOKUP(A81,TierIndicators,3,FALSE)=\"Yes\", \"Mandatory\", \"Optional\")","v":"Optional"},{"$f":"M81","v":0},"qty","Manual",null,"qty","NA",null,"Diesel/Biodiesel"]
["T2","T2.1.2.2","T2.1.2","Internal Combustion Engines (where combusting fuel is used to drive pistons, turbines, rotors etc.)FRDSegmentSplitDiesel/BiodieselFRDSegmentSplitNon-road vehicles",{"$f":"IFERROR(LEN(B82)-LEN(SUBSTITUTE(B82,\".\",\"\") ),\"BAD VALUE\")","v":3},null,null,"Non-road vehicles",{"$f":"IF(VLOOKUP(A82,TierIndicators,3,FALSE)=\"Yes\", \"Mandatory\", \"Optional\")","v":"Optional"},{"$f":"M82","v":0},"qty","Segment Aggregation",{"$f":"SUMIF(C:C,B82,J:J)","v":0},"qty","NA",null,"Diesel/Biodiesel"]
["T2","T2.1.2.2.1","T2.1.2.2","Internal Combustion Engines (where combusting fuel is used to drive pistons, turbines, rotors etc.)FRDSegmentSplitDiesel/BiodieselFRDSegmentSplitNon-road vehiclesFRDSegmentSplitHeavy rail locomotives",{"$f":"IFERROR(LEN(B83)-LEN(SUBSTITUTE(B83,\".\",\"\") ),\"BAD VALUE\")","v":4},"+ (add segment)",null,"Heavy rail locomotives",{"$f":"IF(VLOOKUP(A83,TierIndicators,3,FALSE)=\"Yes\", \"Mandatory\", \"Optional\")","v":"Optional"},{"$f":"M83","v":0},"qty","Manual",null,"qty","NA",null,"Diesel/Biodiesel"]
["T2","T2.1.2.2.2","T2.1.2.2","Internal Combustion Engines (where combusting fuel is used to drive pistons, turbines, rotors etc.)FRDSegmentSplitDiesel/BiodieselFRDSegmentSplitNon-road vehiclesFRDSegmentSplitLight rail vehicles",{"$f":"IFERROR(LEN(B84)-LEN(SUBSTITUTE(B84,\".\",\"\") ),\"BAD VALUE\")","v":4},"+ (add segment)",null,"Light rail vehicles",{"$f":"IF(VLOOKUP(A84,TierIndicators,3,FALSE)=\"Yes\", \"Mandatory\", \"Optional\")","v":"Optional"},{"$f":"M84","v":0},"qty","Manual",null,"qty","NA",null,"Diesel/Biodiesel"]
["T2","T2.1.2.2.3","T2.1.2.2","Internal Combustion Engines (where combusting fuel is used to drive pistons, turbines, rotors etc.)FRDSegmentSplitDiesel/BiodieselFRDSegmentSplitNon-road vehiclesFRDSegmentSplitMarine vessels",{"$f":"IFERROR(LEN(B85)-LEN(SUBSTITUTE(B85,\".\",\"\") ),\"BAD VALUE\")","v":4},"+ (add segment)",null,"Marine vessels",{"$f":"IF(VLOOKUP(A85,TierIndicators,3,FALSE)=\"Yes\", \"Mandatory\", \"Optional\")","v":"Optional"},{"$f":"M85","v":0},"qty","Manual",null,"qty","NA",null,"Diesel/Biodiesel"]
["T2","T2.1.2.2.4","T2.1.2.2","Internal Combustion Engines (where combusting fuel is used to drive pistons, turbines, rotors etc.)FRDSegmentSplitDiesel/BiodieselFRDSegmentSplitNon-road vehiclesFRDSegmentSplitRotary wing aircraft",{"$f":"IFERROR(LEN(B86)-LEN(SUBSTITUTE(B86,\".\",\"\") ),\"BAD VALUE\")","v":4},"+ (add segment)",null,"Rotary wing aircraft",{"$f":"IF(VLOOKUP(A86,TierIndicators,3,FALSE)=\"Yes\", \"Mandatory\", \"Optional\")","v":"Optional"},{"$f":"M86","v":0},"qty","Manual",null,"qty","NA",null,"Diesel/Biodiesel"]
["T2","T2.1.2.2.5","T2.1.2.2","Internal Combustion Engines (where combusting fuel is used to drive pistons, turbines, rotors etc.)FRDSegmentSplitDiesel/BiodieselFRDSegmentSplitNon-road vehiclesFRDSegmentSplitFixed wing aircraft",{"$f":"IFERROR(LEN(B87)-LEN(SUBSTITUTE(B87,\".\",\"\") ),\"BAD VALUE\")","v":4},"+ (add segment)",null,"Fixed wing aircraft",{"$f":"IF(VLOOKUP(A87,TierIndicators,3,FALSE)=\"Yes\", \"Mandatory\", \"Optional\")","v":"Optional"},{"$f":"M87","v":0},"qty","Manual",null,"qty","NA",null,"Diesel/Biodiesel"]
["T2","T2.1.2.2.6","T2.1.2.2","Internal Combustion Engines (where combusting fuel is used to drive pistons, turbines, rotors etc.)FRDSegmentSplitDiesel/BiodieselFRDSegmentSplitNon-road vehiclesFRDSegmentSplitOther non-road vehicles",{"$f":"IFERROR(LEN(B88)-LEN(SUBSTITUTE(B88,\".\",\"\") ),\"BAD VALUE\")","v":4},"+ (add segment)",null,"Other non-road vehicles",{"$f":"IF(VLOOKUP(A88,TierIndicators,3,FALSE)=\"Yes\", \"Mandatory\", \"Optional\")","v":"Optional"},{"$f":"M88","v":0},"qty","Manual",null,"qty","NA",null,"Diesel/Biodiesel"]
["T2","T2.1.3","T2.1","Internal Combustion Engines (where combusting fuel is used to drive pistons, turbines, rotors etc.)FRDSegmentSplitLPG",2,null,null,"LPG","Optional",0,"qty","Segment Aggregation",{"$f":"SUMIF(C:C,B89,J:J)","v":0},"qty","NA",null,"LPG"]
["T2","T2.1.3.1","T2.1.3","Internal Combustion Engines (where combusting fuel is used to drive pistons, turbines, rotors etc.)FRDSegmentSplitLPGFRDSegmentSplitRoad vehicles",{"$f":"IFERROR(LEN(B90)-LEN(SUBSTITUTE(B90,\".\",\"\") ),\"BAD VALUE\")","v":3},null,null,"Road vehicles",{"$f":"IF(VLOOKUP(A90,TierIndicators,3,FALSE)=\"Yes\", \"Mandatory\", \"Optional\")","v":"Optional"},{"$f":"M90","v":0},"qty","Segment Aggregation",{"$f":"SUMIF(C:C,B90,J:J)","v":0},"qty","NA",null,"LPG"]
["T2","T2.1.3.1.1","T2.1.3.1","Internal Combustion Engines (where combusting fuel is used to drive pistons, turbines, rotors etc.)FRDSegmentSplitLPGFRDSegmentSplitRoad vehiclesFRDSegmentSplitTwo-wheeled and three-wheeled vehicles",{"$f":"IFERROR(LEN(B91)-LEN(SUBSTITUTE(B91,\".\",\"\") ),\"BAD VALUE\")","v":4},"+ (add segment)",null,"Two-wheeled and three-wheeled vehicles",{"$f":"IF(VLOOKUP(A91,TierIndicators,3,FALSE)=\"Yes\", \"Mandatory\", \"Optional\")","v":"Optional"},{"$f":"M91","v":0},"qty","Manual",null,"qty","NA",null,"LPG"]
["T2","T2.1.3.1.2","T2.1.3.1","Internal Combustion Engines (where combusting fuel is used to drive pistons, turbines, rotors etc.)FRDSegmentSplitLPGFRDSegmentSplitRoad vehiclesFRDSegmentSplitPassenger vehicles",{"$f":"IFERROR(LEN(B92)-LEN(SUBSTITUTE(B92,\".\",\"\") ),\"BAD VALUE\")","v":4},"+ (add segment)",null,"Passenger vehicles",{"$f":"IF(VLOOKUP(A92,TierIndicators,3,FALSE)=\"Yes\", \"Mandatory\", \"Optional\")","v":"Optional"},{"$f":"M92","v":0},"qty","Manual",null,"qty","NA",null,"LPG"]
["T2","T2.1.3.1.3","T2.1.3.1",{"$f":"IF(E93=1,H93,IFERROR(VLOOKUP(C93,$B$14:$D$1048576,3,FALSE)&\"FRDSegmentSplit\"&H93,H93))","v":"Internal Combustion Engines (where combusting fuel is used to drive pistons, turbines, rotors etc.)FRDSegmentSplitLPGFRDSegmentSplitRoad vehiclesFRDSegmentSplitBuses"},{"$f":"IFERROR(LEN(B93)-LEN(SUBSTITUTE(B93,\".\",\"\") ),\"BAD VALUE\")","v":4},"+ (add segment)",null,"Buses",{"$f":"IF(VLOOKUP(A93,TierIndicators,3,FALSE)=\"Yes\", \"Mandatory\", \"Optional\")","v":"Optional"},{"$f":"M93","v":0},"qty","Manual",null,"qty","NA",null,"LPG"]
["T2","T2.1.3.1.4","T2.1.3.1","Internal Combustion Engines (where combusting fuel is used to drive pistons, turbines, rotors etc.)FRDSegmentSplitLPGFRDSegmentSplitRoad vehiclesFRDSegmentSplitGoods vehicles",{"$f":"IFERROR(LEN(B94)-LEN(SUBSTITUTE(B94,\".\",\"\") ),\"BAD VALUE\")","v":4},"+ (add segment)",null,"Goods vehicles",{"$f":"IF(VLOOKUP(A94,TierIndicators,3,FALSE)=\"Yes\", \"Mandatory\", \"Optional\")","v":"Optional"},{"$f":"M94","v":0},"qty","Manual",null,"qty","NA",null,"LPG"]
["T2","T2.1.3.2","T2.1.3","Internal Combustion Engines (where combusting fuel is used to drive pistons, turbines, rotors etc.)FRDSegmentSplitLPGFRDSegmentSplitNon-road vehicles",{"$f":"IFERROR(LEN(B95)-LEN(SUBSTITUTE(B95,\".\",\"\") ),\"BAD VALUE\")","v":3},null,null,"Non-road vehicles",{"$f":"IF(VLOOKUP(A95,TierIndicators,3,FALSE)=\"Yes\", \"Mandatory\", \"Optional\")","v":"Optional"},{"$f":"M95","v":0},"qty","Segment Aggregation",{"$f":"SUMIF(C:C,B95,J:J)","v":0},"qty","NA",null,"LPG"]
["T2","T2.1.3.2.1","T2.1.3.2","Internal Combustion Engines (where combusting fuel is used to drive pistons, turbines, rotors etc.)FRDSegmentSplitLPGFRDSegmentSplitNon-road vehiclesFRDSegmentSplitHeavy rail locomotives",{"$f":"IFERROR(LEN(B96)-LEN(SUBSTITUTE(B96,\".\",\"\") ),\"BAD VALUE\")","v":4},"+ (add segment)",null,"Heavy rail locomotives",{"$f":"IF(VLOOKUP(A96,TierIndicators,3,FALSE)=\"Yes\", \"Mandatory\", \"Optional\")","v":"Optional"},{"$f":"M96","v":0},"qty","Manual",null,"qty","NA",null,"LPG"]
["T2","T2.1.3.2.2","T2.1.3.2","Internal Combustion Engines (where combusting fuel is used to drive pistons, turbines, rotors etc.)FRDSegmentSplitLPGFRDSegmentSplitNon-road vehiclesFRDSegmentSplitLight rail vehicles",{"$f":"IFERROR(LEN(B97)-LEN(SUBSTITUTE(B97,\".\",\"\") ),\"BAD VALUE\")","v":4},"+ (add segment)",null,"Light rail vehicles",{"$f":"IF(VLOOKUP(A97,TierIndicators,3,FALSE)=\"Yes\", \"Mandatory\", \"Optional\")","v":"Optional"},{"$f":"M97","v":0},"qty","Manual",null,"qty","NA",null,"LPG"]
["T2","T2.1.3.2.3","T2.1.3.2","Internal Combustion Engines (where combusting fuel is used to drive pistons, turbines, rotors etc.)FRDSegmentSplitLPGFRDSegmentSplitNon-road vehiclesFRDSegmentSplitMarine vessels",{"$f":"IFERROR(LEN(B98)-LEN(SUBSTITUTE(B98,\".\",\"\") ),\"BAD VALUE\")","v":4},"+ (add segment)",null,"Marine vessels",{"$f":"IF(VLOOKUP(A98,TierIndicators,3,FALSE)=\"Yes\", \"Mandatory\", \"Optional\")","v":"Optional"},{"$f":"M98","v":0},"qty","Manual",null,"qty","NA",null,"LPG"]
["T2","T2.1.3.2.4","T2.1.3.2","Internal Combustion Engines (where combusting fuel is used to drive pistons, turbines, rotors etc.)FRDSegmentSplitLPGFRDSegmentSplitNon-road vehiclesFRDSegmentSplitRotary wing aircraft",{"$f":"IFERROR(LEN(B99)-LEN(SUBSTITUTE(B99,\".\",\"\") ),\"BAD VALUE\")","v":4},"+ (add segment)",null,"Rotary wing aircraft",{"$f":"IF(VLOOKUP(A99,TierIndicators,3,FALSE)=\"Yes\", \"Mandatory\", \"Optional\")","v":"Optional"},{"$f":"M99","v":0},"qty","Manual",null,"qty","NA",null,"LPG"]
["T2","T2.1.3.2.5","T2.1.3.2","Internal Combustion Engines (where combusting fuel is used to drive pistons, turbines, rotors etc.)FRDSegmentSplitLPGFRDSegmentSplitNon-road vehiclesFRDSegmentSplitFixed wing aircraft",{"$f":"IFERROR(LEN(B100)-LEN(SUBSTITUTE(B100,\".\",\"\") ),\"BAD VALUE\")","v":4},"+ (add segment)",null,"Fixed wing aircraft",{"$f":"IF(VLOOKUP(A100,TierIndicators,3,FALSE)=\"Yes\", \"Mandatory\", \"Optional\")","v":"Optional"},{"$f":"M100","v":0},"qty","Manual",null,"qty","NA",null,"LPG"]
["T2","T2.1.3.2.6","T2.1.3.2","Internal Combustion Engines (where combusting fuel is used to drive pistons, turbines, rotors etc.)FRDSegmentSplitLPGFRDSegmentSplitNon-road vehiclesFRDSegmentSplitOther non-road vehicles",{"$f":"IFERROR(LEN(B101)-LEN(SUBSTITUTE(B101,\".\",\"\") ),\"BAD VALUE\")","v":4},"+ (add segment)",null,"Other non-road vehicles",{"$f":"IF(VLOOKUP(A101,TierIndicators,3,FALSE)=\"Yes\", \"Mandatory\", \"Optional\")","v":"Optional"},{"$f":"M101","v":0},"qty","Manual",null,"qty","NA",null,"LPG"]
["T2","T2.1.4","T2.1","Internal Combustion Engines (where combusting fuel is used to drive pistons, turbines, rotors etc.)FRDSegmentSplitAviation Fuels",2,null,null,"Aviation Fuels","Optional",0,"qty","Segment Aggregation",{"$f":"SUMIF(C:C,B102,J:J)","v":0},"qty","NA",null,"Aviation Fuels"]
["T2","T2.1.4.1","T2.1.4","Internal Combustion Engines (where combusting fuel is used to drive pistons, turbines, rotors etc.)FRDSegmentSplitAviation FuelsFRDSegmentSplitNon-road vehicles",{"$f":"IFERROR(LEN(B103)-LEN(SUBSTITUTE(B103,\".\",\"\") ),\"BAD VALUE\")","v":3},null,null,"Non-road vehicles",{"$f":"IF(VLOOKUP(A103,TierIndicators,3,FALSE)=\"Yes\", \"Mandatory\", \"Optional\")","v":"Optional"},{"$f":"M103","v":0},"qty","Segment Aggregation",{"$f":"SUMIF(C:C,B103,J:J)","v":0},"qty","NA",null,"Aviation Fuels"]
["T2","T2.1.4.1.1","T2.1.4.1","Internal Combustion Engines (where combusting fuel is used to drive pistons, turbines, rotors etc.)FRDSegmentSplitAviation FuelsFRDSegmentSplitNon-road vehiclesFRDSegmentSplitRotary wing aircraft",{"$f":"IFERROR(LEN(B104)-LEN(SUBSTITUTE(B104,\".\",\"\") ),\"BAD VALUE\")","v":4},"+ (add segment)",null,"Rotary wing aircraft",{"$f":"IF(VLOOKUP(A104,TierIndicators,3,FALSE)=\"Yes\", \"Mandatory\", \"Optional\")","v":"Optional"},{"$f":"M104","v":0},"qty","Manual",null,"qty","NA",null,"Aviation Fuels"]
["T2","T2.1.4.1.2","T2.1.4.1","Internal Combustion Engines (where combusting fuel is used to drive pistons, turbines, rotors etc.)FRDSegmentSplitAviation FuelsFRDSegmentSplitNon-road vehiclesFRDSegmentSplitFixed wing aircraft",{"$f":"IFERROR(LEN(B105)-LEN(SUBSTITUTE(B105,\".\",\"\") ),\"BAD VALUE\")","v":4},"+ (add segment)",null,"Fixed wing aircraft",{"$f":"IF(VLOOKUP(A105,TierIndicators,3,FALSE)=\"Yes\", \"Mandatory\", \"Optional\")","v":"Optional"},{"$f":"M105","v":0},"qty","Manual",null,"qty","NA",null,"Aviation Fuels"]
["T2","T2.1.5","T2.1","Internal Combustion Engines (where combusting fuel is used to drive pistons, turbines, rotors etc.)FRDSegmentSplitSolid Fuel",{"$f":"IFERROR(LEN(B106)-LEN(SUBSTITUTE(B106,\".\",\"\") ),\"BAD VALUE\")","v":2},null,null,"Solid Fuel","Optional",0,"qty","Segment Aggregation",{"$f":"SUMIF(C:C,B106,J:J)","v":0},"qty","NA",null,"Solid Fuel"]
["T2","T2.1.5.1","T2.1.5","Internal Combustion Engines (where combusting fuel is used to drive pistons, turbines, rotors etc.)FRDSegmentSplitSolid FuelFRDSegmentSplitNon-road vehicles",3,null,null,"Non-road vehicles",{"$f":"IF(VLOOKUP(A107,TierIndicators,3,FALSE)=\"Yes\", \"Mandatory\", \"Optional\")","v":"Optional"},{"$f":"M107","v":0},"qty","Segment Aggregation",{"$f":"SUMIF(C:C,B107,J:J)","v":0},"qty","NA",null,"Solid Fuel"]
["T2","T2.1.5.1.1","T2.1.5.1","Internal Combustion Engines (where combusting fuel is used to drive pistons, turbines, rotors etc.)FRDSegmentSplitSolid FuelFRDSegmentSplitNon-road vehiclesFRDSegmentSplitHeavy rail locomotives",{"$f":"IFERROR(LEN(B108)-LEN(SUBSTITUTE(B108,\".\",\"\") ),\"BAD VALUE\")","v":4},"+ (add segment)",null,"Heavy rail locomotives",{"$f":"IF(VLOOKUP(A108,TierIndicators,3,FALSE)=\"Yes\", \"Mandatory\", \"Optional\")","v":"Optional"},{"$f":"M108","v":0},"qty","Manual",null,"qty","NA",null,"Solid Fuel"]
["T2","T2.1.5.1.2","T2.1.5.1","Internal Combustion Engines (where combusting fuel is used to drive pistons, turbines, rotors etc.)FRDSegmentSplitSolid FuelFRDSegmentSplitNon-road vehiclesFRDSegmentSplitLight rail vehicles",{"$f":"IFERROR(LEN(B109)-LEN(SUBSTITUTE(B109,\".\",\"\") ),\"BAD VALUE\")","v":4},"+ (add segment)",null,"Light rail vehicles",{"$f":"IF(VLOOKUP(A109,TierIndicators,3,FALSE)=\"Yes\", \"Mandatory\", \"Optional\")","v":"Optional"},{"$f":"M109","v":0},"qty","Manual",null,"qty","NA",null,"Solid Fuel"]
["T2","T2.1.5.1.3","T2.1.5.1","Internal Combustion Engines (where combusting fuel is used to drive pistons, turbines, rotors etc.)FRDSegmentSplitSolid FuelFRDSegmentSplitNon-road vehiclesFRDSegmentSplitMarine vessels",{"$f":"IFERROR(LEN(B110)-LEN(SUBSTITUTE(B110,\".\",\"\") ),\"BAD VALUE\")","v":4},"+ (add segment)",null,"Marine vessels",{"$f":"IF(VLOOKUP(A110,TierIndicators,3,FALSE)=\"Yes\", \"Mandatory\", \"Optional\")","v":"Optional"},{"$f":"M110","v":0},"qty","Manual",null,"qty","NA",null,"Solid Fuel"]
["T2","T2.1.6","T2.1","Internal Combustion Engines (where combusting fuel is used to drive pistons, turbines, rotors etc.)FRDSegmentSplitFuel Oil",2,null,null,"Fuel Oil","Optional",0,"qty","Segment Aggregation",{"$f":"SUMIF(C:C,B111,J:J)","v":0},"qty","NA",null,"Fuel Oil"]
["T2","T2.1.6.1","T2.1.6","Internal Combustion Engines (where combusting fuel is used to drive pistons, turbines, rotors etc.)FRDSegmentSplitFuel OilFRDSegmentSplitNon-road vehicles",3,null,null,"Non-road vehicles",{"$f":"IF(VLOOKUP(A112,TierIndicators,3,FALSE)=\"Yes\", \"Mandatory\", \"Optional\")","v":"Optional"},{"$f":"M112","v":0},"qty","Segment Aggregation",{"$f":"SUMIF(C:C,B112,J:J)","v":0},"qty","NA",null,"Fuel Oil"]
["T2","T2.1.6.1.1","T2.1.6.1","Internal Combustion Engines (where combusting fuel is used to drive pistons, turbines, rotors etc.)FRDSegmentSplitFuel OilFRDSegmentSplitNon-road vehiclesFRDSegmentSplitHeavy rail locomotives",{"$f":"IFERROR(LEN(B113)-LEN(SUBSTITUTE(B113,\".\",\"\") ),\"BAD VALUE\")","v":4},"+ (add segment)",null,"Heavy rail locomotives",{"$f":"IF(VLOOKUP(A113,TierIndicators,3,FALSE)=\"Yes\", \"Mandatory\", \"Optional\")","v":"Optional"},{"$f":"M113","v":0},"qty","Manual",null,"qty","NA",null,"Fuel Oil"]
["T2","T2.1.6.1.2","T2.1.6.1","Internal Combustion Engines (where combusting fuel is used to drive pistons, turbines, rotors etc.)FRDSegmentSplitFuel OilFRDSegmentSplitNon-road vehiclesFRDSegmentSplitLight rail vehicles",{"$f":"IFERROR(LEN(B114)-LEN(SUBSTITUTE(B114,\".\",\"\") ),\"BAD VALUE\")","v":4},"+ (add segment)",null,"Light rail vehicles",{"$f":"IF(VLOOKUP(A114,TierIndicators,3,FALSE)=\"Yes\", \"Mandatory\", \"Optional\")","v":"Optional"},{"$f":"M114","v":0},"qty","Manual",null,"qty","NA",null,"Fuel Oil"]
["T2","T2.1.6.1.3","T2.1.6.1","Internal Combustion Engines (where combusting fuel is used to drive pistons, turbines, rotors etc.)FRDSegmentSplitFuel OilFRDSegmentSplitNon-road vehiclesFRDSegmentSplitMarine vessels",{"$f":"IFERROR(LEN(B115)-LEN(SUBSTITUTE(B115,\".\",\"\") ),\"BAD VALUE\")","v":4},"+ (add segment)",null,"Marine vessels",{"$f":"IF(VLOOKUP(A115,TierIndicators,3,FALSE)=\"Yes\", \"Mandatory\", \"Optional\")","v":"Optional"},{"$f":"M115","v":0},"qty","Manual",null,"qty","NA",null,"Fuel Oil"]
["T2","T2.1.6.1.4","T2.1.6.1","Internal Combustion Engines (where combusting fuel is used to drive pistons, turbines, rotors etc.)FRDSegmentSplitFuel OilFRDSegmentSplitNon-road vehiclesFRDSegmentSplitRotary wing aircraft",{"$f":"IFERROR(LEN(B116)-LEN(SUBSTITUTE(B116,\".\",\"\") ),\"BAD VALUE\")","v":4},"+ (add segment)",null,"Rotary wing aircraft",{"$f":"IF(VLOOKUP(A116,TierIndicators,3,FALSE)=\"Yes\", \"Mandatory\", \"Optional\")","v":"Optional"},{"$f":"M116","v":0},"qty","Manual",null,"qty","NA",null,"Fuel Oil"]
["T2",{"$f":"C117 & \".\" & COUNTIF($C$1:OFFSET(C117,-1,0),C117) +1","v":"T2.1.6.1.5"},"T2.1.6.1","Internal Combustion Engines (where combusting fuel is used to drive pistons, turbines, rotors etc.)FRDSegmentSplitFuel OilFRDSegmentSplitNon-road vehiclesFRDSegmentSplitFixed wing aircraft",{"$f":"IFERROR(LEN(B117)-LEN(SUBSTITUTE(B117,\".\",\"\") ),\"BAD VALUE\")","v":4},"+ (add segment)",null,"Fixed wing aircraft",{"$f":"IF(VLOOKUP(A117,TierIndicators,3,FALSE)=\"Yes\", \"Mandatory\", \"Optional\")","v":"Optional"},{"$f":"M117","v":0},"qty","Manual",null,"qty","NA",null,"Fuel Oil"]
["T2",{"$f":"C118 & \".\" & COUNTIF($C$1:OFFSET(C118,-1,0),C118) +1","v":"T2.1.6.1.6"},"T2.1.6.1","Internal Combustion Engines (where combusting fuel is used to drive pistons, turbines, rotors etc.)FRDSegmentSplitFuel OilFRDSegmentSplitNon-road vehiclesFRDSegmentSplitOther non-road vehicles",{"$f":"IFERROR(LEN(B118)-LEN(SUBSTITUTE(B118,\".\",\"\") ),\"BAD VALUE\")","v":4},"+ (add segment)",null,"Other non-road vehicles",{"$f":"IF(VLOOKUP(A118,TierIndicators,3,FALSE)=\"Yes\", \"Mandatory\", \"Optional\")","v":"Optional"},{"$f":"M118","v":0},"qty","Manual",null,"qty","NA",null,"Fuel Oil"]
["T2","T2.2","T2","Hybrid (a vehicle which uses multiple primary fuel sources)",1,null,null,"Hybrid (a vehicle which uses multiple primary fuel sources)","Optional",0,"qty","Segment Aggregation",{"$f":"SUMIF(C:C,B119,J:J)","v":0},"qty","NA",null,"Hybrid (a vehicle which uses multiple primary fuel sources)"]
["T2","T2.2.1","T2.2","Hybrid (a vehicle which uses multiple primary fuel sources)FRDSegmentSplitPlug-in Hybrid Electric Vehicle (PHEV)",{"$f":"IFERROR(LEN(B120)-LEN(SUBSTITUTE(B120,\".\",\"\") ),\"BAD VALUE\")","v":2},null,null,"Plug-in Hybrid Electric Vehicle (PHEV)","Optional",0,"qty","Segment Aggregation",{"$f":"SUMIF(C:C,B120,J:J)","v":0},"qty","NA",null,"Plug-in Hybrid Electric Vehicle (PHEV)"]
["T2","T2.2.1.1","T2.2.1","Hybrid (a vehicle which uses multiple primary fuel sources)FRDSegmentSplitPlug-in Hybrid Electric Vehicle (PHEV)FRDSegmentSplitRoad vehicles",{"$f":"IFERROR(LEN(B121)-LEN(SUBSTITUTE(B121,\".\",\"\") ),\"BAD VALUE\")","v":3},null,null,"Road vehicles",{"$f":"IF(VLOOKUP(A121,TierIndicators,3,FALSE)=\"Yes\", \"Mandatory\", \"Optional\")","v":"Optional"},{"$f":"M121","v":0},"qty","Segment Aggregation",{"$f":"SUMIF(C:C,B121,J:J)","v":0},"qty","NA",null,"Plug-in Hybrid Electric Vehicle (PHEV)"]
["T2","T2.2.1.1.1","T2.2.1.1","Hybrid (a vehicle which uses multiple primary fuel sources)FRDSegmentSplitPlug-in Hybrid Electric Vehicle (PHEV)FRDSegmentSplitRoad vehiclesFRDSegmentSplitTwo-wheeled and three-wheeled vehicles",{"$f":"IFERROR(LEN(B122)-LEN(SUBSTITUTE(B122,\".\",\"\") ),\"BAD VALUE\")","v":4},"+ (add segment)",null,"Two-wheeled and three-wheeled vehicles",{"$f":"IF(VLOOKUP(A122,TierIndicators,3,FALSE)=\"Yes\", \"Mandatory\", \"Optional\")","v":"Optional"},{"$f":"M122","v":0},"qty","Manual",null,"qty","NA",null,"Plug-in Hybrid Electric Vehicle (PHEV)"]
["T2","T2.2.1.1.2","T2.2.1.1","Hybrid (a vehicle which uses multiple primary fuel sources)FRDSegmentSplitPlug-in Hybrid Electric Vehicle (PHEV)FRDSegmentSplitRoad vehiclesFRDSegmentSplitPassenger vehicles",{"$f":"IFERROR(LEN(B123)-LEN(SUBSTITUTE(B123,\".\",\"\") ),\"BAD VALUE\")","v":4},"+ (add segment)",null,"Passenger vehicles",{"$f":"IF(VLOOKUP(A123,TierIndicators,3,FALSE)=\"Yes\", \"Mandatory\", \"Optional\")","v":"Optional"},{"$f":"M123","v":0},"qty","Manual",null,"qty","NA",null,"Plug-in Hybrid Electric Vehicle (PHEV)"]
["T2","T2.2.1.1.3","T2.2.1.1","Hybrid (a vehicle which uses multiple primary fuel sources)FRDSegmentSplitPlug-in Hybrid Electric Vehicle (PHEV)FRDSegmentSplitRoad vehiclesFRDSegmentSplitBuses",{"$f":"IFERROR(LEN(B124)-LEN(SUBSTITUTE(B124,\".\",\"\") ),\"BAD VALUE\")","v":4},"+ (add segment)",null,"Buses",{"$f":"IF(VLOOKUP(A124,TierIndicators,3,FALSE)=\"Yes\", \"Mandatory\", \"Optional\")","v":"Optional"},{"$f":"M124","v":0},"qty","Manual",null,"qty","NA",null,"Plug-in Hybrid Electric Vehicle (PHEV)"]
["T2","T2.2.1.1.4","T2.2.1.1",{"$f":"IF(E125=1,H125,IFERROR(VLOOKUP(C125,$B$14:$D$1048576,3,FALSE)&\"FRDSegmentSplit\"&H125,H125))","v":"Hybrid (a vehicle which uses multiple primary fuel sources)FRDSegmentSplitPlug-in Hybrid Electric Vehicle (PHEV)FRDSegmentSplitRoad vehiclesFRDSegmentSplitGoods vehicles"},{"$f":"IFERROR(LEN(B125)-LEN(SUBSTITUTE(B125,\".\",\"\") ),\"BAD VALUE\")","v":4},"+ (add segment)",null,"Goods vehicles",{"$f":"IF(VLOOKUP(A125,TierIndicators,3,FALSE)=\"Yes\", \"Mandatory\", \"Optional\")","v":"Optional"},{"$f":"M125","v":0},"qty","Manual",null,"qty","NA",null,"Plug-in Hybrid Electric Vehicle (PHEV)"]
["T2","T2.2.1.2","T2.2.1","Hybrid (a vehicle which uses multiple primary fuel sources)FRDSegmentSplitPlug-in Hybrid Electric Vehicle (PHEV)FRDSegmentSplitNon-road vehicles",{"$f":"IFERROR(LEN(B126)-LEN(SUBSTITUTE(B126,\".\",\"\") ),\"BAD VALUE\")","v":3},null,null,"Non-road vehicles",{"$f":"IF(VLOOKUP(A126,TierIndicators,3,FALSE)=\"Yes\", \"Mandatory\", \"Optional\")","v":"Optional"},{"$f":"M126","v":0},"qty","Segment Aggregation",{"$f":"SUMIF(C:C,B126,J:J)","v":0},"qty","NA",null,"Plug-in Hybrid Electric Vehicle (PHEV)"]
["T2","T2.2.1.2.1","T2.2.1.2","Hybrid (a vehicle which uses multiple primary fuel sources)FRDSegmentSplitPlug-in Hybrid Electric Vehicle (PHEV)FRDSegmentSplitNon-road vehiclesFRDSegmentSplitHeavy rail locomotives",{"$f":"IFERROR(LEN(B127)-LEN(SUBSTITUTE(B127,\".\",\"\") ),\"BAD VALUE\")","v":4},"+ (add segment)",null,"Heavy rail locomotives",{"$f":"IF(VLOOKUP(A127,TierIndicators,3,FALSE)=\"Yes\", \"Mandatory\", \"Optional\")","v":"Optional"},{"$f":"M127","v":0},"qty","Manual",null,"qty","NA",null,"Plug-in Hybrid Electric Vehicle (PHEV)"]
["T2","T2.2.1.2.2","T2.2.1.2","Hybrid (a vehicle which uses multiple primary fuel sources)FRDSegmentSplitPlug-in Hybrid Electric Vehicle (PHEV)FRDSegmentSplitNon-road vehiclesFRDSegmentSplitLight rail vehicles",{"$f":"IFERROR(LEN(B128)-LEN(SUBSTITUTE(B128,\".\",\"\") ),\"BAD VALUE\")","v":4},"+ (add segment)",null,"Light rail vehicles",{"$f":"IF(VLOOKUP(A128,TierIndicators,3,FALSE)=\"Yes\", \"Mandatory\", \"Optional\")","v":"Optional"},{"$f":"M128","v":0},"qty","Manual",null,"qty","NA",null,"Plug-in Hybrid Electric Vehicle (PHEV)"]
["T2","T2.2.1.2.3","T2.2.1.2","Hybrid (a vehicle which uses multiple primary fuel sources)FRDSegmentSplitPlug-in Hybrid Electric Vehicle (PHEV)FRDSegmentSplitNon-road vehiclesFRDSegmentSplitMarine vessels",{"$f":"IFERROR(LEN(B129)-LEN(SUBSTITUTE(B129,\".\",\"\") ),\"BAD VALUE\")","v":4},"+ (add segment)",null,"Marine vessels",{"$f":"IF(VLOOKUP(A129,TierIndicators,3,FALSE)=\"Yes\", \"Mandatory\", \"Optional\")","v":"Optional"},{"$f":"M129","v":0},"qty","Manual",null,"qty","NA",null,"Plug-in Hybrid Electric Vehicle (PHEV)"]
["T2","T2.2.1.2.4","T2.2.1.2","Hybrid (a vehicle which uses multiple primary fuel sources)FRDSegmentSplitPlug-in Hybrid Electric Vehicle (PHEV)FRDSegmentSplitNon-road vehiclesFRDSegmentSplitRotary wing aircraft",{"$f":"IFERROR(LEN(B130)-LEN(SUBSTITUTE(B130,\".\",\"\") ),\"BAD VALUE\")","v":4},"+ (add segment)",null,"Rotary wing aircraft",{"$f":"IF(VLOOKUP(A130,TierIndicators,3,FALSE)=\"Yes\", \"Mandatory\", \"Optional\")","v":"Optional"},{"$f":"M130","v":0},"qty","Manual",null,"qty","NA",null,"Plug-in Hybrid Electric Vehicle (PHEV)"]
["T2","T2.2.1.2.5","T2.2.1.2","Hybrid (a vehicle which uses multiple primary fuel sources)FRDSegmentSplitPlug-in Hybrid Electric Vehicle (PHEV)FRDSegmentSplitNon-road vehiclesFRDSegmentSplitFixed wing aircraft",{"$f":"IFERROR(LEN(B131)-LEN(SUBSTITUTE(B131,\".\",\"\") ),\"BAD VALUE\")","v":4},"+ (add segment)",null,"Fixed wing aircraft",{"$f":"IF(VLOOKUP(A131,TierIndicators,3,FALSE)=\"Yes\", \"Mandatory\", \"Optional\")","v":"Optional"},{"$f":"M131","v":0},"qty","Manual",null,"qty","NA",null,"Plug-in Hybrid Electric Vehicle (PHEV)"]
["T2","T2.2.1.2.6","T2.2.1.2","Hybrid (a vehicle which uses multiple primary fuel sources)FRDSegmentSplitPlug-in Hybrid Electric Vehicle (PHEV)FRDSegmentSplitNon-road vehiclesFRDSegmentSplitOther non-road vehicles",{"$f":"IFERROR(LEN(B132)-LEN(SUBSTITUTE(B132,\".\",\"\") ),\"BAD VALUE\")","v":4},"+ (add segment)",null,"Other non-road vehicles",{"$f":"IF(VLOOKUP(A132,TierIndicators,3,FALSE)=\"Yes\", \"Mandatory\", \"Optional\")","v":"Optional"},{"$f":"M132","v":0},"qty","Manual",null,"qty","NA",null,"Plug-in Hybrid Electric Vehicle (PHEV)"]
["T2","T2.2.2","T2.2","Hybrid (a vehicle which uses multiple primary fuel sources)FRDSegmentSplitRange-extended electric vehicle",2,null,null,"Range-extended electric vehicle","Optional",0,"qty","Segment Aggregation",{"$f":"SUMIF(C:C,B133,J:J)","v":0},"qty","NA",null,"Range-extended electric vehicle"]
["T2","T2.2.2.1","T2.2.2","Hybrid (a vehicle which uses multiple primary fuel sources)FRDSegmentSplitRange-extended electric vehicleFRDSegmentSplitRoad vehicles",{"$f":"IFERROR(LEN(B134)-LEN(SUBSTITUTE(B134,\".\",\"\") ),\"BAD VALUE\")","v":3},null,null,"Road vehicles",{"$f":"IF(VLOOKUP(A134,TierIndicators,3,FALSE)=\"Yes\", \"Mandatory\", \"Optional\")","v":"Optional"},{"$f":"M134","v":0},"qty","Segment Aggregation",{"$f":"SUMIF(C:C,B134,J:J)","v":0},"qty","NA",null,"Range-extended electric vehicle"]
["T2","T2.2.2.1.1","T2.2.2.1","Hybrid (a vehicle which uses multiple primary fuel sources)FRDSegmentSplitRange-extended electric vehicleFRDSegmentSplitRoad vehiclesFRDSegmentSplitTwo-wheeled and three-wheeled vehicles",{"$f":"IFERROR(LEN(B135)-LEN(SUBSTITUTE(B135,\".\",\"\") ),\"BAD VALUE\")","v":4},"+ (add segment)",null,"Two-wheeled and three-wheeled vehicles",{"$f":"IF(VLOOKUP(A135,TierIndicators,3,FALSE)=\"Yes\", \"Mandatory\", \"Optional\")","v":"Optional"},{"$f":"M135","v":0},"qty","Manual",null,"qty","NA",null,"Range-extended electric vehicle"]
["T2","T2.2.2.1.2","T2.2.2.1","Hybrid (a vehicle which uses multiple primary fuel sources)FRDSegmentSplitRange-extended electric vehicleFRDSegmentSplitRoad vehiclesFRDSegmentSplitPassenger vehicles",{"$f":"IFERROR(LEN(B136)-LEN(SUBSTITUTE(B136,\".\",\"\") ),\"BAD VALUE\")","v":4},"+ (add segment)",null,"Passenger vehicles",{"$f":"IF(VLOOKUP(A136,TierIndicators,3,FALSE)=\"Yes\", \"Mandatory\", \"Optional\")","v":"Optional"},{"$f":"M136","v":0},"qty","Manual",null,"qty","NA",null,"Range-extended electric vehicle"]
["T2","T2.2.2.1.3","T2.2.2.1","Hybrid (a vehicle which uses multiple primary fuel sources)FRDSegmentSplitRange-extended electric vehicleFRDSegmentSplitRoad vehiclesFRDSegmentSplitBuses",{"$f":"IFERROR(LEN(B137)-LEN(SUBSTITUTE(B137,\".\",\"\") ),\"BAD VALUE\")","v":4},"+ (add segment)",null,"Buses",{"$f":"IF(VLOOKUP(A137,TierIndicators,3,FALSE)=\"Yes\", \"Mandatory\", \"Optional\")","v":"Optional"},{"$f":"M137","v":0},"qty","Manual",null,"qty","NA",null,"Range-extended electric vehicle"]
["T2","T2.2.2.1.4","T2.2.2.1","Hybrid (a vehicle which uses multiple primary fuel sources)FRDSegmentSplitRange-extended electric vehicleFRDSegmentSplitRoad vehiclesFRDSegmentSplitGoods vehicles",{"$f":"IFERROR(LEN(B138)-LEN(SUBSTITUTE(B138,\".\",\"\") ),\"BAD VALUE\")","v":4},"+ (add segment)",null,"Goods vehicles",{"$f":"IF(VLOOKUP(A138,TierIndicators,3,FALSE)=\"Yes\", \"Mandatory\", \"Optional\")","v":"Optional"},{"$f":"M138","v":0},"qty","Manual",null,"qty","NA",null,"Range-extended electric vehicle"]
["T2","T2.2.2.2","T2.2.2","Hybrid (a vehicle which uses multiple primary fuel sources)FRDSegmentSplitRange-extended electric vehicleFRDSegmentSplitNon-road vehicles",{"$f":"IFERROR(LEN(B139)-LEN(SUBSTITUTE(B139,\".\",\"\") ),\"BAD VALUE\")","v":3},null,null,"Non-road vehicles",{"$f":"IF(VLOOKUP(A139,TierIndicators,3,FALSE)=\"Yes\", \"Mandatory\", \"Optional\")","v":"Optional"},{"$f":"M139","v":0},"qty","Segment Aggregation",{"$f":"SUMIF(C:C,B139,J:J)","v":0},"qty","NA",null,"Range-extended electric vehicle"]
["T2","T2.2.2.2.1","T2.2.2.2","Hybrid (a vehicle which uses multiple primary fuel sources)FRDSegmentSplitRange-extended electric vehicleFRDSegmentSplitNon-road vehiclesFRDSegmentSplitHeavy rail locomotives",{"$f":"IFERROR(LEN(B140)-LEN(SUBSTITUTE(B140,\".\",\"\") ),\"BAD VALUE\")","v":4},"+ (add segment)",null,"Heavy rail locomotives",{"$f":"IF(VLOOKUP(A140,TierIndicators,3,FALSE)=\"Yes\", \"Mandatory\", \"Optional\")","v":"Optional"},{"$f":"M140","v":0},"qty","Manual",null,"qty","NA",null,"Range-extended electric vehicle"]
["T2","T2.2.2.2.2","T2.2.2.2","Hybrid (a vehicle which uses multiple primary fuel sources)FRDSegmentSplitRange-extended electric vehicleFRDSegmentSplitNon-road vehiclesFRDSegmentSplitLight rail vehicles",{"$f":"IFERROR(LEN(B141)-LEN(SUBSTITUTE(B141,\".\",\"\") ),\"BAD VALUE\")","v":4},"+ (add segment)",null,"Light rail vehicles",{"$f":"IF(VLOOKUP(A141,TierIndicators,3,FALSE)=\"Yes\", \"Mandatory\", \"Optional\")","v":"Optional"},{"$f":"M141","v":0},"qty","Manual",null,"qty","NA",null,"Range-extended electric vehicle"]
["T2","T2.2.2.2.3","T2.2.2.2","Hybrid (a vehicle which uses multiple primary fuel sources)FRDSegmentSplitRange-extended electric vehicleFRDSegmentSplitNon-road vehiclesFRDSegmentSplitMarine vessels",{"$f":"IFERROR(LEN(B142)-LEN(SUBSTITUTE(B142,\".\",\"\") ),\"BAD VALUE\")","v":4},"+ (add segment)",null,"Marine vessels",{"$f":"IF(VLOOKUP(A142,TierIndicators,3,FALSE)=\"Yes\", \"Mandatory\", \"Optional\")","v":"Optional"},{"$f":"M142","v":0},"qty","Manual",null,"qty","NA",null,"Range-extended electric vehicle"]
["T2","T2.2.2.2.4","T2.2.2.2","Hybrid (a vehicle which uses multiple primary fuel sources)FRDSegmentSplitRange-extended electric vehicleFRDSegmentSplitNon-road vehiclesFRDSegmentSplitRotary wing aircraft",{"$f":"IFERROR(LEN(B143)-LEN(SUBSTITUTE(B143,\".\",\"\") ),\"BAD VALUE\")","v":4},"+ (add segment)",null,"Rotary wing aircraft",{"$f":"IF(VLOOKUP(A143,TierIndicators,3,FALSE)=\"Yes\", \"Mandatory\", \"Optional\")","v":"Optional"},{"$f":"M143","v":0},"qty","Manual",null,"qty","NA",null,"Range-extended electric vehicle"]
["T2","T2.2.2.2.5","T2.2.2.2","Hybrid (a vehicle which uses multiple primary fuel sources)FRDSegmentSplitRange-extended electric vehicleFRDSegmentSplitNon-road vehiclesFRDSegmentSplitFixed wing aircraft",{"$f":"IFERROR(LEN(B144)-LEN(SUBSTITUTE(B144,\".\",\"\") ),\"BAD VALUE\")","v":4},"+ (add segment)",null,"Fixed wing aircraft",{"$f":"IF(VLOOKUP(A144,TierIndicators,3,FALSE)=\"Yes\", \"Mandatory\", \"Optional\")","v":"Optional"},{"$f":"M144","v":0},"qty","Manual",null,"qty","NA",null,"Range-extended electric vehicle"]
["T2","T2.2.2.2.6","T2.2.2.2","Hybrid (a vehicle which uses multiple primary fuel sources)FRDSegmentSplitRange-extended electric vehicleFRDSegmentSplitNon-road vehiclesFRDSegmentSplitOther non-road vehicles",{"$f":"IFERROR(LEN(B145)-LEN(SUBSTITUTE(B145,\".\",\"\") ),\"BAD VALUE\")","v":4},"+ (add segment)",null,"Other non-road vehicles",{"$f":"IF(VLOOKUP(A145,TierIndicators,3,FALSE)=\"Yes\", \"Mandatory\", \"Optional\")","v":"Optional"},{"$f":"M145","v":0},"qty","Manual",null,"qty","NA",null,"Range-extended electric vehicle"]
["T2","T2.3","T2","Electric propulsion",1,null,null,"Electric propulsion","Optional",0,"qty","Segment Aggregation",{"$f":"SUMIF(C:C,B146,J:J)","v":0},"qty","NA",null,"Electric propulsion"]
["T2","T2.3.1","T2.3","Electric propulsionFRDSegmentSplitBattery Electric Vehicle (BEV)",2,null,null,"Battery Electric Vehicle (BEV)","Optional",0,"qty","Segment Aggregation",{"$f":"SUMIF(C:C,B147,J:J)","v":0},"qty","NA",null,"Battery Electric Vehicle (BEV)"]
["T2","T2.3.1.1","T2.3.1","Electric propulsionFRDSegmentSplitBattery Electric Vehicle (BEV)FRDSegmentSplitRoad vehicles",{"$f":"IFERROR(LEN(B148)-LEN(SUBSTITUTE(B148,\".\",\"\") ),\"BAD VALUE\")","v":3},null,null,"Road vehicles",{"$f":"IF(VLOOKUP(A148,TierIndicators,3,FALSE)=\"Yes\", \"Mandatory\", \"Optional\")","v":"Optional"},{"$f":"M148","v":0},"qty","Segment Aggregation",{"$f":"SUMIF(C:C,B148,J:J)","v":0},"qty","NA",null,"Battery Electric Vehicle (BEV)"]
["T2","T2.3.1.1.1","T2.3.1.1","Electric propulsionFRDSegmentSplitBattery Electric Vehicle (BEV)FRDSegmentSplitRoad vehiclesFRDSegmentSplitTwo-wheeled and three-wheeled vehicles",{"$f":"IFERROR(LEN(B149)-LEN(SUBSTITUTE(B149,\".\",\"\") ),\"BAD VALUE\")","v":4},"+ (add segment)",null,"Two-wheeled and three-wheeled vehicles",{"$f":"IF(VLOOKUP(A149,TierIndicators,3,FALSE)=\"Yes\", \"Mandatory\", \"Optional\")","v":"Optional"},{"$f":"M149","v":0},"qty","Manual",null,"qty","NA",null,"Battery Electric Vehicle (BEV)"]
["T2","T2.3.1.1.2","T2.3.1.1","Electric propulsionFRDSegmentSplitBattery Electric Vehicle (BEV)FRDSegmentSplitRoad vehiclesFRDSegmentSplitPassenger vehicles",{"$f":"IFERROR(LEN(B150)-LEN(SUBSTITUTE(B150,\".\",\"\") ),\"BAD VALUE\")","v":4},"+ (add segment)",null,"Passenger vehicles",{"$f":"IF(VLOOKUP(A150,TierIndicators,3,FALSE)=\"Yes\", \"Mandatory\", \"Optional\")","v":"Optional"},{"$f":"M150","v":0},"qty","Manual",null,"qty","NA",null,"Battery Electric Vehicle (BEV)"]
["T2","T2.3.1.1.3","T2.3.1.1","Electric propulsionFRDSegmentSplitBattery Electric Vehicle (BEV)FRDSegmentSplitRoad vehiclesFRDSegmentSplitBuses",{"$f":"IFERROR(LEN(B151)-LEN(SUBSTITUTE(B151,\".\",\"\") ),\"BAD VALUE\")","v":4},"+ (add segment)",null,"Buses",{"$f":"IF(VLOOKUP(A151,TierIndicators,3,FALSE)=\"Yes\", \"Mandatory\", \"Optional\")","v":"Optional"},{"$f":"M151","v":0},"qty","Manual",null,"qty","NA",null,"Battery Electric Vehicle (BEV)"]
["T2","T2.3.1.1.4","T2.3.1.1","Electric propulsionFRDSegmentSplitBattery Electric Vehicle (BEV)FRDSegmentSplitRoad vehiclesFRDSegmentSplitGoods vehicles",{"$f":"IFERROR(LEN(B152)-LEN(SUBSTITUTE(B152,\".\",\"\") ),\"BAD VALUE\")","v":4},"+ (add segment)",null,"Goods vehicles",{"$f":"IF(VLOOKUP(A152,TierIndicators,3,FALSE)=\"Yes\", \"Mandatory\", \"Optional\")","v":"Optional"},{"$f":"M152","v":0},"qty","Manual",null,"qty","NA",null,"Battery Electric Vehicle (BEV)"]
["T2","T2.3.1.2","T2.3.1","Electric propulsionFRDSegmentSplitBattery Electric Vehicle (BEV)FRDSegmentSplitNon-road vehicles",{"$f":"IFERROR(LEN(B153)-LEN(SUBSTITUTE(B153,\".\",\"\") ),\"BAD VALUE\")","v":3},null,null,"Non-road vehicles",{"$f":"IF(VLOOKUP(A153,TierIndicators,3,FALSE)=\"Yes\", \"Mandatory\", \"Optional\")","v":"Optional"},{"$f":"M153","v":0},"qty","Segment Aggregation",{"$f":"SUMIF(C:C,B153,J:J)","v":0},"qty","NA",null,"Battery Electric Vehicle (BEV)"]
["T2","T2.3.1.2.1","T2.3.1.2","Electric propulsionFRDSegmentSplitBattery Electric Vehicle (BEV)FRDSegmentSplitNon-road vehiclesFRDSegmentSplitHeavy rail locomotives",{"$f":"IFERROR(LEN(B154)-LEN(SUBSTITUTE(B154,\".\",\"\") ),\"BAD VALUE\")","v":4},"+ (add segment)",null,"Heavy rail locomotives",{"$f":"IF(VLOOKUP(A154,TierIndicators,3,FALSE)=\"Yes\", \"Mandatory\", \"Optional\")","v":"Optional"},{"$f":"M154","v":0},"qty","Manual",null,"qty","NA",null,"Battery Electric Vehicle (BEV)"]
["T2","T2.3.1.2.2","T2.3.1.2","Electric propulsionFRDSegmentSplitBattery Electric Vehicle (BEV)FRDSegmentSplitNon-road vehiclesFRDSegmentSplitLight rail vehicles",{"$f":"IFERROR(LEN(B155)-LEN(SUBSTITUTE(B155,\".\",\"\") ),\"BAD VALUE\")","v":4},"+ (add segment)",null,"Light rail vehicles",{"$f":"IF(VLOOKUP(A155,TierIndicators,3,FALSE)=\"Yes\", \"Mandatory\", \"Optional\")","v":"Optional"},{"$f":"M155","v":0},"qty","Manual",null,"qty","NA",null,"Battery Electric Vehicle (BEV)"]
["T2","T2.3.1.2.3","T2.3.1.2","Electric propulsionFRDSegmentSplitBattery Electric Vehicle (BEV)FRDSegmentSplitNon-road vehiclesFRDSegmentSplitMarine vessels",{"$f":"IFERROR(LEN(B156)-LEN(SUBSTITUTE(B156,\".\",\"\") ),\"BAD VALUE\")","v":4},"+ (add segment)",null,"Marine vessels",{"$f":"IF(VLOOKUP(A156,TierIndicators,3,FALSE)=\"Yes\", \"Mandatory\", \"Optional\")","v":"Optional"},{"$f":"M156","v":0},"qty","Manual",null,"qty","NA",null,"Battery Electric Vehicle (BEV)"]
["T2","T2.3.1.2.4","T2.3.1.2",{"$f":"IF(E157=1,H157,IFERROR(VLOOKUP(C157,$B$14:$D$1048576,3,FALSE)&\"FRDSegmentSplit\"&H157,H157))","v":"Electric propulsionFRDSegmentSplitBattery Electric Vehicle (BEV)FRDSegmentSplitNon-road vehiclesFRDSegmentSplitRotary wing aircraft"},{"$f":"IFERROR(LEN(B157)-LEN(SUBSTITUTE(B157,\".\",\"\") ),\"BAD VALUE\")","v":4},"+ (add segment)",null,"Rotary wing aircraft",{"$f":"IF(VLOOKUP(A157,TierIndicators,3,FALSE)=\"Yes\", \"Mandatory\", \"Optional\")","v":"Optional"},{"$f":"M157","v":0},"qty","Manual",null,"qty","NA",null,"Battery Electric Vehicle (BEV)"]
["T2","T2.3.1.2.5","T2.3.1.2","Electric propulsionFRDSegmentSplitBattery Electric Vehicle (BEV)FRDSegmentSplitNon-road vehiclesFRDSegmentSplitFixed wing aircraft",{"$f":"IFERROR(LEN(B158)-LEN(SUBSTITUTE(B158,\".\",\"\") ),\"BAD VALUE\")","v":4},"+ (add segment)",null,"Fixed wing aircraft",{"$f":"IF(VLOOKUP(A158,TierIndicators,3,FALSE)=\"Yes\", \"Mandatory\", \"Optional\")","v":"Optional"},{"$f":"M158","v":0},"qty","Manual",null,"qty","NA",null,"Battery Electric Vehicle (BEV)"]
["T2","T2.3.1.2.6","T2.3.1.2","Electric propulsionFRDSegmentSplitBattery Electric Vehicle (BEV)FRDSegmentSplitNon-road vehiclesFRDSegmentSplitOther non-road vehicles",{"$f":"IFERROR(LEN(B159)-LEN(SUBSTITUTE(B159,\".\",\"\") ),\"BAD VALUE\")","v":4},"+ (add segment)",null,"Other non-road vehicles",{"$f":"IF(VLOOKUP(A159,TierIndicators,3,FALSE)=\"Yes\", \"Mandatory\", \"Optional\")","v":"Optional"},{"$f":"M159","v":0},"qty","Manual",null,"qty","NA",null,"Battery Electric Vehicle (BEV)"]
["T2","T2.3.2","T2.3","Electric propulsionFRDSegmentSplitFuel Cell Electric Vehicle (FCEV)",{"$f":"IFERROR(LEN(B160)-LEN(SUBSTITUTE(B160,\".\",\"\") ),\"BAD VALUE\")","v":2},null,null,"Fuel Cell Electric Vehicle (FCEV)","Optional",0,"qty","Segment Aggregation",{"$f":"SUMIF(C:C,B160,J:J)","v":0},"qty","NA",null,"Fuel Cell Electric Vehicle (FCEV)"]
["T2","T2.3.2.1","T2.3.2","Electric propulsionFRDSegmentSplitFuel Cell Electric Vehicle (FCEV)FRDSegmentSplitRoad vehicles",{"$f":"IFERROR(LEN(B161)-LEN(SUBSTITUTE(B161,\".\",\"\") ),\"BAD VALUE\")","v":3},null,null,"Road vehicles",{"$f":"IF(VLOOKUP(A161,TierIndicators,3,FALSE)=\"Yes\", \"Mandatory\", \"Optional\")","v":"Optional"},{"$f":"M161","v":0},"qty","Segment Aggregation",{"$f":"SUMIF(C:C,B161,J:J)","v":0},"qty","NA",null,"Fuel Cell Electric Vehicle (FCEV)"]
["T2","T2.3.2.1.1","T2.3.2.1","Electric propulsionFRDSegmentSplitFuel Cell Electric Vehicle (FCEV)FRDSegmentSplitRoad vehiclesFRDSegmentSplitTwo-wheeled and three-wheeled vehicles",{"$f":"IFERROR(LEN(B162)-LEN(SUBSTITUTE(B162,\".\",\"\") ),\"BAD VALUE\")","v":4},"+ (add segment)",null,"Two-wheeled and three-wheeled vehicles",{"$f":"IF(VLOOKUP(A162,TierIndicators,3,FALSE)=\"Yes\", \"Mandatory\", \"Optional\")","v":"Optional"},{"$f":"M162","v":0},"qty","Manual",null,"qty","NA",null,"Fuel Cell Electric Vehicle (FCEV)"]
["T2","T2.3.2.1.2","T2.3.2.1","Electric propulsionFRDSegmentSplitFuel Cell Electric Vehicle (FCEV)FRDSegmentSplitRoad vehiclesFRDSegmentSplitPassenger vehicles",{"$f":"IFERROR(LEN(B163)-LEN(SUBSTITUTE(B163,\".\",\"\") ),\"BAD VALUE\")","v":4},"+ (add segment)",null,"Passenger vehicles",{"$f":"IF(VLOOKUP(A163,TierIndicators,3,FALSE)=\"Yes\", \"Mandatory\", \"Optional\")","v":"Optional"},{"$f":"M163","v":0},"qty","Manual",null,"qty","NA",null,"Fuel Cell Electric Vehicle (FCEV)"]
["T2","T2.3.2.1.3","T2.3.2.1","Electric propulsionFRDSegmentSplitFuel Cell Electric Vehicle (FCEV)FRDSegmentSplitRoad vehiclesFRDSegmentSplitBuses",{"$f":"IFERROR(LEN(B164)-LEN(SUBSTITUTE(B164,\".\",\"\") ),\"BAD VALUE\")","v":4},"+ (add segment)",null,"Buses",{"$f":"IF(VLOOKUP(A164,TierIndicators,3,FALSE)=\"Yes\", \"Mandatory\", \"Optional\")","v":"Optional"},{"$f":"M164","v":0},"qty","Manual",null,"qty","NA",null,"Fuel Cell Electric Vehicle (FCEV)"]
["T2","T2.3.2.1.4","T2.3.2.1","Electric propulsionFRDSegmentSplitFuel Cell Electric Vehicle (FCEV)FRDSegmentSplitRoad vehiclesFRDSegmentSplitGoods vehicles",{"$f":"IFERROR(LEN(B165)-LEN(SUBSTITUTE(B165,\".\",\"\") ),\"BAD VALUE\")","v":4},"+ (add segment)",null,"Goods vehicles",{"$f":"IF(VLOOKUP(A165,TierIndicators,3,FALSE)=\"Yes\", \"Mandatory\", \"Optional\")","v":"Optional"},{"$f":"M165","v":0},"qty","Manual",null,"qty","NA",null,"Fuel Cell Electric Vehicle (FCEV)"]
["T2","T2.3.2.2","T2.3.2","Electric propulsionFRDSegmentSplitFuel Cell Electric Vehicle (FCEV)FRDSegmentSplitNon-road vehicles",{"$f":"IFERROR(LEN(B166)-LEN(SUBSTITUTE(B166,\".\",\"\") ),\"BAD VALUE\")","v":3},null,null,"Non-road vehicles",{"$f":"IF(VLOOKUP(A166,TierIndicators,3,FALSE)=\"Yes\", \"Mandatory\", \"Optional\")","v":"Optional"},{"$f":"M166","v":0},"qty","Segment Aggregation",{"$f":"SUMIF(C:C,B166,J:J)","v":0},"qty","NA",null,"Fuel Cell Electric Vehicle (FCEV)"]
["T2","T2.3.2.2.1","T2.3.2.2","Electric propulsionFRDSegmentSplitFuel Cell Electric Vehicle (FCEV)FRDSegmentSplitNon-road vehiclesFRDSegmentSplitHeavy rail locomotives",{"$f":"IFERROR(LEN(B167)-LEN(SUBSTITUTE(B167,\".\",\"\") ),\"BAD VALUE\")","v":4},"+ (add segment)",null,"Heavy rail locomotives",{"$f":"IF(VLOOKUP(A167,TierIndicators,3,FALSE)=\"Yes\", \"Mandatory\", \"Optional\")","v":"Optional"},{"$f":"M167","v":0},"qty","Manual",null,"qty","NA",null,"Fuel Cell Electric Vehicle (FCEV)"]
["T2","T2.3.2.2.2","T2.3.2.2","Electric propulsionFRDSegmentSplitFuel Cell Electric Vehicle (FCEV)FRDSegmentSplitNon-road vehiclesFRDSegmentSplitLight rail vehicles",{"$f":"IFERROR(LEN(B168)-LEN(SUBSTITUTE(B168,\".\",\"\") ),\"BAD VALUE\")","v":4},"+ (add segment)",null,"Light rail vehicles",{"$f":"IF(VLOOKUP(A168,TierIndicators,3,FALSE)=\"Yes\", \"Mandatory\", \"Optional\")","v":"Optional"},{"$f":"M168","v":0},"qty","Manual",null,"qty","NA",null,"Fuel Cell Electric Vehicle (FCEV)"]
["T2","T2.3.2.2.3","T2.3.2.2","Electric propulsionFRDSegmentSplitFuel Cell Electric Vehicle (FCEV)FRDSegmentSplitNon-road vehiclesFRDSegmentSplitMarine vessels",{"$f":"IFERROR(LEN(B169)-LEN(SUBSTITUTE(B169,\".\",\"\") ),\"BAD VALUE\")","v":4},"+ (add segment)",null,"Marine vessels",{"$f":"IF(VLOOKUP(A169,TierIndicators,3,FALSE)=\"Yes\", \"Mandatory\", \"Optional\")","v":"Optional"},{"$f":"M169","v":0},"qty","Manual",null,"qty","NA",null,"Fuel Cell Electric Vehicle (FCEV)"]
["T2","T2.3.2.2.4","T2.3.2.2","Electric propulsionFRDSegmentSplitFuel Cell Electric Vehicle (FCEV)FRDSegmentSplitNon-road vehiclesFRDSegmentSplitRotary wing aircraft",{"$f":"IFERROR(LEN(B170)-LEN(SUBSTITUTE(B170,\".\",\"\") ),\"BAD VALUE\")","v":4},"+ (add segment)",null,"Rotary wing aircraft",{"$f":"IF(VLOOKUP(A170,TierIndicators,3,FALSE)=\"Yes\", \"Mandatory\", \"Optional\")","v":"Optional"},{"$f":"M170","v":0},"qty","Manual",null,"qty","NA",null,"Fuel Cell Electric Vehicle (FCEV)"]
["T2","T2.3.2.2.5","T2.3.2.2","Electric propulsionFRDSegmentSplitFuel Cell Electric Vehicle (FCEV)FRDSegmentSplitNon-road vehiclesFRDSegmentSplitFixed wing aircraft",{"$f":"IFERROR(LEN(B171)-LEN(SUBSTITUTE(B171,\".\",\"\") ),\"BAD VALUE\")","v":4},"+ (add segment)",null,"Fixed wing aircraft",{"$f":"IF(VLOOKUP(A171,TierIndicators,3,FALSE)=\"Yes\", \"Mandatory\", \"Optional\")","v":"Optional"},{"$f":"M171","v":0},"qty","Manual",null,"qty","NA",null,"Fuel Cell Electric Vehicle (FCEV)"]
["T2","T2.3.2.2.6","T2.3.2.2","Electric propulsionFRDSegmentSplitFuel Cell Electric Vehicle (FCEV)FRDSegmentSplitNon-road vehiclesFRDSegmentSplitOther non-road vehicles",{"$f":"IFERROR(LEN(B172)-LEN(SUBSTITUTE(B172,\".\",\"\") ),\"BAD VALUE\")","v":4},"+ (add segment)",null,"Other non-road vehicles",{"$f":"IF(VLOOKUP(A172,TierIndicators,3,FALSE)=\"Yes\", \"Mandatory\", \"Optional\")","v":"Optional"},{"$f":"M172","v":0},"qty","Manual",null,"qty","NA",null,"Fuel Cell Electric Vehicle (FCEV)"]
["T2","T2.3.3","T2.3","Electric propulsionFRDSegmentSplitExternally Powered (such as rail locomotives and trams)",2,null,null,"Externally Powered (such as rail locomotives and trams)","Optional",0,"qty","Segment Aggregation",{"$f":"SUMIF(C:C,B173,J:J)","v":0},"qty","NA",null,"Externally Powered (such as rail locomotives and trams)"]
["T2","T2.3.3.1","T2.3.3","Electric propulsionFRDSegmentSplitExternally Powered (such as rail locomotives and trams)FRDSegmentSplitNon-road vehicles",{"$f":"IFERROR(LEN(B174)-LEN(SUBSTITUTE(B174,\".\",\"\") ),\"BAD VALUE\")","v":3},null,null,"Non-road vehicles",{"$f":"IF(VLOOKUP(A174,TierIndicators,3,FALSE)=\"Yes\", \"Mandatory\", \"Optional\")","v":"Optional"},{"$f":"M174","v":0},"qty","Segment Aggregation",{"$f":"SUMIF(C:C,B174,J:J)","v":0},"qty","NA",null,"Externally Powered (such as rail locomotives and trams)"]
["T2","T2.3.3.1.1","T2.3.3.1","Electric propulsionFRDSegmentSplitExternally Powered (such as rail locomotives and trams)FRDSegmentSplitNon-road vehiclesFRDSegmentSplitHeavy rail locomotives",{"$f":"IFERROR(LEN(B175)-LEN(SUBSTITUTE(B175,\".\",\"\") ),\"BAD VALUE\")","v":4},"+ (add segment)",null,"Heavy rail locomotives",{"$f":"IF(VLOOKUP(A175,TierIndicators,3,FALSE)=\"Yes\", \"Mandatory\", \"Optional\")","v":"Optional"},{"$f":"M175","v":0},"qty","Manual",null,"qty","NA",null,"Externally Powered (such as rail locomotives and trams)"]
["T2","T2.3.3.1.2","T2.3.3.1","Electric propulsionFRDSegmentSplitExternally Powered (such as rail locomotives and trams)FRDSegmentSplitNon-road vehiclesFRDSegmentSplitLight rail vehicles",{"$f":"IFERROR(LEN(B176)-LEN(SUBSTITUTE(B176,\".\",\"\") ),\"BAD VALUE\")","v":4},"+ (add segment)",null,"Light rail vehicles",{"$f":"IF(VLOOKUP(A176,TierIndicators,3,FALSE)=\"Yes\", \"Mandatory\", \"Optional\")","v":"Optional"},{"$f":"M176","v":0},"qty","Manual",null,"qty","NA",null,"Externally Powered (such as rail locomotives and trams)"]
[]
[]
[null,"T3","Greenhouse gas emissions from vehicle fleet segmented by fuel type and vehicle category (tonnes CO2-e)"]
[null,"ID","Parent ID","FRDSegment","Segment Level",null,null,"Description","Flag","Final Value","Final Unit","Input Type","Input Value","Input Unit","CHECK"]
["T3","T3","NA",{"$f":"IF(E181=1,H181,IFERROR(VLOOKUP(C181,$B$14:$D$1048576,3,FALSE)&\"FRDSegmentSplit\"&H181,H181))","v":"GRAND TOTAL"},{"$f":"IFERROR(LEN(B181)-LEN(SUBSTITUTE(B181,\".\",\"\") ),\"BAD VALUE\")","v":0},null,null,"GRAND TOTAL",{"$f":"IF(VLOOKUP(A181,TierIndicators,3,FALSE)=\"Yes\", \"Mandatory\", \"Optional\")","v":"Optional"},{"$f":"IF(N181=\"NA\",_xlfn.VALUETOTEXT(M181),M181*IF(OR(N181=\"L\", N181=\"kL\"),VLOOKUP(\"F2-\"&Q181,Admin!BN:BT,5,FALSE)*IF(N181=\"kL\",1000,1)*OFFSET(Admin!$AR$3,MATCH(\"MJ\",convSources,0),MATCH(K181,convTargets,0)),IF(N181=\"Kg\",VLOOKUP(\"F2-\"&Q181,Admin!BN:BT,6,FALSE)*OFFSET(Admin!$AR$3,MATCH(\"MJ\",convSources,0),MATCH(K181,convTargets,0)),IF(N181=\"m3\",VLOOKUP(\"F2-\"&Q181,Admin!BN:BT,7,FALSE)*OFFSET(Admin!$AR$3,MATCH(\"Kg\",convSources,0),MATCH(K181,convTargets,0)),OFFSET(Admin!$AR$3,MATCH(N181,convSources,0),MATCH(K181,convTargets,0))))))","v":0},"Tonnes CO2-e","Segment Aggregation",{"$f":"SUMIF(C:C,B181,J:J)-J217","v":0},"Tonnes CO2-e",{"$f":"IF(OR(L181=\"Segment Aggregation\",L181=\"Auto-Calc\"),\"NA\",IF(AND(I181=\"Mandatory\",OR(M181=\"\",N181=\"\")), \"FAIL\", IF(I181=\"Optional\",\"NA\",\"PASS\")))","v":"NA"},null,"GRAND TOTAL",null,{"$f":"SUM(S182:S222)","v":0},{"$f":"SUM(T182:T222)","v":0},{"$f":"SUM(U182:U222)","v":0}]
["T3","T3.1","T3","Petrol",{"$f":"IFERROR(LEN(B182)-LEN(SUBSTITUTE(B182,\".\",\"\") ),\"BAD VALUE\")","v":1},null,null,"Petrol","Optional",{"$f":"IF(N182=\"NA\",_xlfn.VALUETOTEXT(M182),M182*IF(OR(N182=\"L\", N182=\"kL\"),VLOOKUP(\"F2-\"&Q182,Admin!BN:BT,5,FALSE)*IF(N182=\"kL\",1000,1)*OFFSET(Admin!$AR$3,MATCH(\"MJ\",convSources,0),MATCH(K182,convTargets,0)),IF(N182=\"Kg\",VLOOKUP(\"F2-\"&Q182,Admin!BN:BT,6,FALSE)*OFFSET(Admin!$AR$3,MATCH(\"MJ\",convSources,0),MATCH(K182,convTargets,0)),IF(N182=\"m3\",VLOOKUP(\"F2-\"&Q182,Admin!BN:BT,7,FALSE)*OFFSET(Admin!$AR$3,MATCH(\"Kg\",convSources,0),MATCH(K182,convTargets,0)),OFFSET(Admin!$AR$3,MATCH(N182,convSources,0),MATCH(K182,convTargets,0))))))","v":0},"Tonnes CO2-e","Segment Aggregation",{"$f":"SUMIF(C:C,B182,J:J)","v":0},"Tonnes CO2-e","NA",null,"Petrol"]
["T3","T3.1.1","T3.1","PetrolFRDSegmentSplitPetrol (Unleaded/Premium)",{"$f":"IFERROR(LEN(B183)-LEN(SUBSTITUTE(B183,\".\",\"\") ),\"BAD VALUE\")","v":2},null,null,"Petrol (Unleaded/Premium)",{"$f":"IF(VLOOKUP(A183,TierIndicators,3,FALSE)=\"Yes\", \"Mandatory\", \"Optional\")","v":"Optional"},{"$f":"IF(N183=\"NA\",_xlfn.VALUETOTEXT(M183),M183*IF(OR(N183=\"L\", N183=\"kL\"),VLOOKUP(\"F2-\"&Q183,Admin!BN:BT,5,FALSE)*IF(N183=\"kL\",1000,1)*OFFSET(Admin!$AR$3,MATCH(\"MJ\",convSources,0),MATCH(K183,convTargets,0)),IF(N183=\"Kg\",VLOOKUP(\"F2-\"&Q183,Admin!BN:BT,6,FALSE)*OFFSET(Admin!$AR$3,MATCH(\"MJ\",convSources,0),MATCH(K183,convTargets,0)),IF(N183=\"m3\",VLOOKUP(\"F2-\"&Q183,Admin!BN:BT,7,FALSE)*OFFSET(Admin!$AR$3,MATCH(\"Kg\",convSources,0),MATCH(K183,convTargets,0)),OFFSET(Admin!$AR$3,MATCH(N183,convSources,0),MATCH(K183,convTargets,0))))))","v":0},"Tonnes CO2-e","Segment Aggregation",{"$f":"SUMIF(C:C,B183,J:J)","v":0},"Tonnes CO2-e","NA",null,"Petrol (Unleaded/Premium)"]
["T3","T3.1.1.1","T3.1.1","PetrolFRDSegmentSplitPetrol (Unleaded/Premium)FRDSegmentSplitRoad vehicles",{"$f":"IFERROR(LEN(B184)-LEN(SUBSTITUTE(B184,\".\",\"\") ),\"BAD VALUE\")","v":3},null,null,"Road vehicles",{"$f":"IF(VLOOKUP(A184,TierIndicators,3,FALSE)=\"Yes\", \"Mandatory\", \"Optional\")","v":"Optional"},{"$f":"IF(N184=\"NA\",_xlfn.VALUETOTEXT(M184),M184*IF(OR(N184=\"L\", N184=\"kL\"),VLOOKUP(\"F2-\"&Q184,Admin!BN:BT,5,FALSE)*IF(N184=\"kL\",1000,1)*OFFSET(Admin!$AR$3,MATCH(\"MJ\",convSources,0),MATCH(K184,convTargets,0)),IF(N184=\"Kg\",VLOOKUP(\"F2-\"&Q184,Admin!BN:BT,6,FALSE)*OFFSET(Admin!$AR$3,MATCH(\"MJ\",convSources,0),MATCH(K184,convTargets,0)),IF(N184=\"m3\",VLOOKUP(\"F2-\"&Q184,Admin!BN:BT,7,FALSE)*OFFSET(Admin!$AR$3,MATCH(\"Kg\",convSources,0),MATCH(K184,convTargets,0)),OFFSET(Admin!$AR$3,MATCH(N184,convSources,0),MATCH(K184,convTargets,0))))))","v":0},"Tonnes CO2-e","Auto-Calc",{"$f":"J18 * OFFSET(Admin!$AR$3,MATCH(K18,convSources,0),MATCH(\"GJ\",convTargets,0))  *  IFERROR(VLOOKUP(A184 & \"-\" & Q184,Admin!BN:BQ,4,FALSE),0)","v":0},"Tonnes CO2-e","NA",null,"Petrol (Unleaded/Premium)",null,{"$f":"J18 * OFFSET(Admin!$AR$3,MATCH(K18,convSources,0),MATCH(\"GJ\",convTargets,0))  *  IFERROR(VLOOKUP(A184 & \"-\" & Q184,Admin!BN:CC,14,FALSE),0)","v":0},{"$f":"J18 * OFFSET(Admin!$AR$3,MATCH(K18,convSources,0),MATCH(\"GJ\",convTargets,0))  *  IFERROR(VLOOKUP(A184 & \"-\" & Q184,Admin!BN:CC,15,FALSE),0)","v":0},{"$f":"J18 * OFFSET(Admin!$AR$3,MATCH(K18,convSources,0),MATCH(\"GJ\",convTargets,0))  *  IFERROR(VLOOKUP(A184 & \"-\" & Q184,Admin!BN:CC,16,FALSE),0)","v":0}]
["T3","T3.1.1.2","T3.1.1","PetrolFRDSegmentSplitPetrol (Unleaded/Premium)FRDSegmentSplitNon-road vehicles",3,null,null,"Non-road vehicles","Optional",{"$f":"IF(N185=\"NA\",_xlfn.VALUETOTEXT(M185),M185*IF(OR(N185=\"L\", N185=\"kL\"),VLOOKUP(\"F2-\"&Q185,Admin!BN:BT,5,FALSE)*IF(N185=\"kL\",1000,1)*OFFSET(Admin!$AR$3,MATCH(\"MJ\",convSources,0),MATCH(K185,convTargets,0)),IF(N185=\"Kg\",VLOOKUP(\"F2-\"&Q185,Admin!BN:BT,6,FALSE)*OFFSET(Admin!$AR$3,MATCH(\"MJ\",convSources,0),MATCH(K185,convTargets,0)),IF(N185=\"m3\",VLOOKUP(\"F2-\"&Q185,Admin!BN:BT,7,FALSE)*OFFSET(Admin!$AR$3,MATCH(\"Kg\",convSources,0),MATCH(K185,convTargets,0)),OFFSET(Admin!$AR$3,MATCH(N185,convSources,0),MATCH(K185,convTargets,0))))))","v":0},"Tonnes CO2-e","Auto-Calc",{"$f":"J19 * OFFSET(Admin!$AR$3,MATCH(K19,convSources,0),MATCH(\"GJ\",convTargets,0))  *  IFERROR(VLOOKUP(A185 & \"-\" & Q185,Admin!BN:BQ,4,FALSE),0)","v":0},"Tonnes CO2-e","NA",null,"Petrol (Unleaded/Premium)",null,{"$f":"J19 * OFFSET(Admin!$AR$3,MATCH(K19,convSources,0),MATCH(\"GJ\",convTargets,0))  *  IFERROR(VLOOKUP(A185 & \"-\" & Q185,Admin!BN:CC,14,FALSE),0)","v":0},{"$f":"J19 * OFFSET(Admin!$AR$3,MATCH(K19,convSources,0),MATCH(\"GJ\",convTargets,0))  *  IFERROR(VLOOKUP(A185 & \"-\" & Q185,Admin!BN:CC,15,FALSE),0)","v":0},{"$f":"J19 * OFFSET(Admin!$AR$3,MATCH(K19,convSources,0),MATCH(\"GJ\",convTargets,0))  *  IFERROR(VLOOKUP(A185 & \"-\" & Q185,Admin!BN:CC,16,FALSE),0)","v":0}]
["T3","T3.1.2","T3.1","PetrolFRDSegmentSplitPetrol (E10)",{"$f":"IFERROR(LEN(B186)-LEN(SUBSTITUTE(B186,\".\",\"\") ),\"BAD VALUE\")","v":2},null,null,"Petrol (E10)",{"$f":"IF(VLOOKUP(A186,TierIndicators,3,FALSE)=\"Yes\", \"Mandatory\", \"Optional\")","v":"Optional"},{"$f":"IF(N186=\"NA\",_xlfn.VALUETOTEXT(M186),M186*IF(OR(N186=\"L\", N186=\"kL\"),VLOOKUP(\"F2-\"&Q186,Admin!BN:BT,5,FALSE)*IF(N186=\"kL\",1000,1)*OFFSET(Admin!$AR$3,MATCH(\"MJ\",convSources,0),MATCH(K186,convTargets,0)),IF(N186=\"Kg\",VLOOKUP(\"F2-\"&Q186,Admin!BN:BT,6,FALSE)*OFFSET(Admin!$AR$3,MATCH(\"MJ\",convSources,0),MATCH(K186,convTargets,0)),IF(N186=\"m3\",VLOOKUP(\"F2-\"&Q186,Admin!BN:BT,7,FALSE)*OFFSET(Admin!$AR$3,MATCH(\"Kg\",convSources,0),MATCH(K186,convTargets,0)),OFFSET(Admin!$AR$3,MATCH(N186,convSources,0),MATCH(K186,convTargets,0))))))","v":0},"Tonnes CO2-e","Segment Aggregation",{"$f":"SUMIF(C:C,B186,J:J)","v":0},"Tonnes CO2-e","NA",null,"Petrol (E10)"]
["T3","T3.1.2.1","T3.1.2","PetrolFRDSegmentSplitPetrol (E10)FRDSegmentSplitRoad vehicles",{"$f":"IFERROR(LEN(B187)-LEN(SUBSTITUTE(B187,\".\",\"\") ),\"BAD VALUE\")","v":3},null,null,"Road vehicles","Optional",{"$f":"IF(N187=\"NA\",_xlfn.VALUETOTEXT(M187),M187*IF(OR(N187=\"L\", N187=\"kL\"),VLOOKUP(\"F2-\"&Q187,Admin!BN:BT,5,FALSE)*IF(N187=\"kL\",1000,1)*OFFSET(Admin!$AR$3,MATCH(\"MJ\",convSources,0),MATCH(K187,convTargets,0)),IF(N187=\"Kg\",VLOOKUP(\"F2-\"&Q187,Admin!BN:BT,6,FALSE)*OFFSET(Admin!$AR$3,MATCH(\"MJ\",convSources,0),MATCH(K187,convTargets,0)),IF(N187=\"m3\",VLOOKUP(\"F2-\"&Q187,Admin!BN:BT,7,FALSE)*OFFSET(Admin!$AR$3,MATCH(\"Kg\",convSources,0),MATCH(K187,convTargets,0)),OFFSET(Admin!$AR$3,MATCH(N187,convSources,0),MATCH(K187,convTargets,0))))))","v":0},"Tonnes CO2-e","Auto-Calc",{"$f":"J21 * OFFSET(Admin!$AR$3,MATCH(K21,convSources,0),MATCH(\"GJ\",convTargets,0))  *  IFERROR(VLOOKUP(A187 & \"-\" & Q187,Admin!BN:BQ,4,FALSE),0)","v":0},"Tonnes CO2-e","NA",null,"Petrol (E10)",null,{"$f":"J21 * OFFSET(Admin!$AR$3,MATCH(K21,convSources,0),MATCH(\"GJ\",convTargets,0))  *  IFERROR(VLOOKUP(A187 & \"-\" & Q187,Admin!BN:CC,14,FALSE),0)","v":0},{"$f":"J21 * OFFSET(Admin!$AR$3,MATCH(K21,convSources,0),MATCH(\"GJ\",convTargets,0))  *  IFERROR(VLOOKUP(A187 & \"-\" & Q187,Admin!BN:CC,15,FALSE),0)","v":0},{"$f":"J21 * OFFSET(Admin!$AR$3,MATCH(K21,convSources,0),MATCH(\"GJ\",convTargets,0))  *  IFERROR(VLOOKUP(A187 & \"-\" & Q187,Admin!BN:CC,16,FALSE),0)","v":0}]
["T3","T3.1.2.2","T3.1.2","PetrolFRDSegmentSplitPetrol (E10)FRDSegmentSplitNon-road vehicles",{"$f":"IFERROR(LEN(B188)-LEN(SUBSTITUTE(B188,\".\",\"\") ),\"BAD VALUE\")","v":3},null,null,"Non-road vehicles","Optional",{"$f":"IF(N188=\"NA\",_xlfn.VALUETOTEXT(M188),M188*IF(OR(N188=\"L\", N188=\"kL\"),VLOOKUP(\"F2-\"&Q188,Admin!BN:BT,5,FALSE)*IF(N188=\"kL\",1000,1)*OFFSET(Admin!$AR$3,MATCH(\"MJ\",convSources,0),MATCH(K188,convTargets,0)),IF(N188=\"Kg\",VLOOKUP(\"F2-\"&Q188,Admin!BN:BT,6,FALSE)*OFFSET(Admin!$AR$3,MATCH(\"MJ\",convSources,0),MATCH(K188,convTargets,0)),IF(N188=\"m3\",VLOOKUP(\"F2-\"&Q188,Admin!BN:BT,7,FALSE)*OFFSET(Admin!$AR$3,MATCH(\"Kg\",convSources,0),MATCH(K188,convTargets,0)),OFFSET(Admin!$AR$3,MATCH(N188,convSources,0),MATCH(K188,convTargets,0))))))","v":0},"Tonnes CO2-e","Auto-Calc",{"$f":"J22 * OFFSET(Admin!$AR$3,MATCH(K22,convSources,0),MATCH(\"GJ\",convTargets,0))  *  IFERROR(VLOOKUP(A188 & \"-\" & Q188,Admin!BN:BQ,4,FALSE),0)","v":0},"Tonnes CO2-e","NA",null,"Petrol (E10)",null,{"$f":"J22 * OFFSET(Admin!$AR$3,MATCH(K22,convSources,0),MATCH(\"GJ\",convTargets,0))  *  IFERROR(VLOOKUP(A188 & \"-\" & Q188,Admin!BN:CC,14,FALSE),0)","v":0},{"$f":"J22 * OFFSET(Admin!$AR$3,MATCH(K22,convSources,0),MATCH(\"GJ\",convTargets,0))  *  IFERROR(VLOOKUP(A188 & \"-\" & Q188,Admin!BN:CC,15,FALSE),0)","v":0},{"$f":"J22 * OFFSET(Admin!$AR$3,MATCH(K22,convSources,0),MATCH(\"GJ\",convTargets,0))  *  IFERROR(VLOOKUP(A188 & \"-\" & Q188,Admin!BN:CC,16,FALSE),0)","v":0}]
["T3","T3.2","T3","Diesel",{"$f":"IFERROR(LEN(B189)-LEN(SUBSTITUTE(B189,\".\",\"\") ),\"BAD VALUE\")","v":1},null,null,"Diesel","Optional",{"$f":"IF(N189=\"NA\",_xlfn.VALUETOTEXT(M189),M189*IF(OR(N189=\"L\", N189=\"kL\"),VLOOKUP(\"F2-\"&Q189,Admin!BN:BT,5,FALSE)*IF(N189=\"kL\",1000,1)*OFFSET(Admin!$AR$3,MATCH(\"MJ\",convSources,0),MATCH(K189,convTargets,0)),IF(N189=\"Kg\",VLOOKUP(\"F2-\"&Q189,Admin!BN:BT,6,FALSE)*OFFSET(Admin!$AR$3,MATCH(\"MJ\",convSources,0),MATCH(K189,convTargets,0)),IF(N189=\"m3\",VLOOKUP(\"F2-\"&Q189,Admin!BN:BT,7,FALSE)*OFFSET(Admin!$AR$3,MATCH(\"Kg\",convSources,0),MATCH(K189,convTargets,0)),OFFSET(Admin!$AR$3,MATCH(N189,convSources,0),MATCH(K189,convTargets,0))))))","v":0},"Tonnes CO2-e","Segment Aggregation",{"$f":"SUMIF(C:C,B189,J:J)","v":0},"Tonnes CO2-e","NA",null,"Diesel"]
["T3","T3.2.1","T3.2","DieselFRDSegmentSplitRoad vehicles",2,null,null,"Road vehicles","Optional",{"$f":"IF(N190=\"NA\",_xlfn.VALUETOTEXT(M190),M190*IF(OR(N190=\"L\", N190=\"kL\"),VLOOKUP(\"F2-\"&Q190,Admin!BN:BT,5,FALSE)*IF(N190=\"kL\",1000,1)*OFFSET(Admin!$AR$3,MATCH(\"MJ\",convSources,0),MATCH(K190,convTargets,0)),IF(N190=\"Kg\",VLOOKUP(\"F2-\"&Q190,Admin!BN:BT,6,FALSE)*OFFSET(Admin!$AR$3,MATCH(\"MJ\",convSources,0),MATCH(K190,convTargets,0)),IF(N190=\"m3\",VLOOKUP(\"F2-\"&Q190,Admin!BN:BT,7,FALSE)*OFFSET(Admin!$AR$3,MATCH(\"Kg\",convSources,0),MATCH(K190,convTargets,0)),OFFSET(Admin!$AR$3,MATCH(N190,convSources,0),MATCH(K190,convTargets,0))))))","v":0},"Tonnes CO2-e","Auto-Calc",{"$f":"J24 * OFFSET(Admin!$AR$3,MATCH(K24,convSources,0),MATCH(\"GJ\",convTargets,0))  *  IFERROR(VLOOKUP(A190 & \"-\" & Q190,Admin!BN:BQ,4,FALSE),0)","v":0},"Tonnes CO2-e","NA",null,"Diesel",null,{"$f":"J24 * OFFSET(Admin!$AR$3,MATCH(K24,convSources,0),MATCH(\"GJ\",convTargets,0))  *  IFERROR(VLOOKUP(A190 & \"-\" & Q190,Admin!BN:CC,14,FALSE),0)","v":0},{"$f":"J24 * OFFSET(Admin!$AR$3,MATCH(K24,convSources,0),MATCH(\"GJ\",convTargets,0))  *  IFERROR(VLOOKUP(A190 & \"-\" & Q190,Admin!BN:CC,15,FALSE),0)","v":0},{"$f":"J24 * OFFSET(Admin!$AR$3,MATCH(K24,convSources,0),MATCH(\"GJ\",convTargets,0))  *  IFERROR(VLOOKUP(A190 & \"-\" & Q190,Admin!BN:CC,16,FALSE),0)","v":0}]
["T3","T3.2.2","T3.2","DieselFRDSegmentSplitNon-road vehicles",2,null,null,"Non-road vehicles","Optional",{"$f":"IF(N191=\"NA\",_xlfn.VALUETOTEXT(M191),M191*IF(OR(N191=\"L\", N191=\"kL\"),VLOOKUP(\"F2-\"&Q191,Admin!BN:BT,5,FALSE)*IF(N191=\"kL\",1000,1)*OFFSET(Admin!$AR$3,MATCH(\"MJ\",convSources,0),MATCH(K191,convTargets,0)),IF(N191=\"Kg\",VLOOKUP(\"F2-\"&Q191,Admin!BN:BT,6,FALSE)*OFFSET(Admin!$AR$3,MATCH(\"MJ\",convSources,0),MATCH(K191,convTargets,0)),IF(N191=\"m3\",VLOOKUP(\"F2-\"&Q191,Admin!BN:BT,7,FALSE)*OFFSET(Admin!$AR$3,MATCH(\"Kg\",convSources,0),MATCH(K191,convTargets,0)),OFFSET(Admin!$AR$3,MATCH(N191,convSources,0),MATCH(K191,convTargets,0))))))","v":0},"Tonnes CO2-e","Auto-Calc",{"$f":"J25 * OFFSET(Admin!$AR$3,MATCH(K25,convSources,0),MATCH(\"GJ\",convTargets,0))  *  IFERROR(VLOOKUP(A191 & \"-\" & Q191,Admin!BN:BQ,4,FALSE),0)","v":0},"Tonnes CO2-e","NA",null,"Diesel",null,{"$f":"J25 * OFFSET(Admin!$AR$3,MATCH(K25,convSources,0),MATCH(\"GJ\",convTargets,0))  *  IFERROR(VLOOKUP(A191 & \"-\" & Q191,Admin!BN:CC,14,FALSE),0)","v":0},{"$f":"J25 * OFFSET(Admin!$AR$3,MATCH(K25,convSources,0),MATCH(\"GJ\",convTargets,0))  *  IFERROR(VLOOKUP(A191 & \"-\" & Q191,Admin!BN:CC,15,FALSE),0)","v":0},{"$f":"J25 * OFFSET(Admin!$AR$3,MATCH(K25,convSources,0),MATCH(\"GJ\",convTargets,0))  *  IFERROR(VLOOKUP(A191 & \"-\" & Q191,Admin!BN:CC,16,FALSE),0)","v":0}]
["T3","T3.3","T3","Biodiesel",{"$f":"IFERROR(LEN(B192)-LEN(SUBSTITUTE(B192,\".\",\"\") ),\"BAD VALUE\")","v":1},null,null,"Biodiesel","Optional",{"$f":"IF(N192=\"NA\",_xlfn.VALUETOTEXT(M192),M192*IF(OR(N192=\"L\", N192=\"kL\"),VLOOKUP(\"F2-\"&Q192,Admin!BN:BT,5,FALSE)*IF(N192=\"kL\",1000,1)*OFFSET(Admin!$AR$3,MATCH(\"MJ\",convSources,0),MATCH(K192,convTargets,0)),IF(N192=\"Kg\",VLOOKUP(\"F2-\"&Q192,Admin!BN:BT,6,FALSE)*OFFSET(Admin!$AR$3,MATCH(\"MJ\",convSources,0),MATCH(K192,convTargets,0)),IF(N192=\"m3\",VLOOKUP(\"F2-\"&Q192,Admin!BN:BT,7,FALSE)*OFFSET(Admin!$AR$3,MATCH(\"Kg\",convSources,0),MATCH(K192,convTargets,0)),OFFSET(Admin!$AR$3,MATCH(N192,convSources,0),MATCH(K192,convTargets,0))))))","v":0},"Tonnes CO2-e","Segment Aggregation",{"$f":"SUMIF(C:C,B192,J:J)","v":0},"Tonnes CO2-e","NA",null,"Biodiesel"]
["T3","T3.3.1","T3.3","BiodieselFRDSegmentSplitRoad vehicles",2,"+ (add segment)",null,"Road vehicles","Optional",{"$f":"IF(N193=\"NA\",_xlfn.VALUETOTEXT(M193),M193*IF(OR(N193=\"L\", N193=\"kL\"),VLOOKUP(\"F2-\"&Q193,Admin!BN:BT,5,FALSE)*IF(N193=\"kL\",1000,1)*OFFSET(Admin!$AR$3,MATCH(\"MJ\",convSources,0),MATCH(K193,convTargets,0)),IF(N193=\"Kg\",VLOOKUP(\"F2-\"&Q193,Admin!BN:BT,6,FALSE)*OFFSET(Admin!$AR$3,MATCH(\"MJ\",convSources,0),MATCH(K193,convTargets,0)),IF(N193=\"m3\",VLOOKUP(\"F2-\"&Q193,Admin!BN:BT,7,FALSE)*OFFSET(Admin!$AR$3,MATCH(\"Kg\",convSources,0),MATCH(K193,convTargets,0)),OFFSET(Admin!$AR$3,MATCH(N193,convSources,0),MATCH(K193,convTargets,0))))))","v":0},"Tonnes CO2-e","Manual",null,"Tonnes CO2-e","NA",null,"Biodiesel"]
["T3","T3.3.2","T3.3","BiodieselFRDSegmentSplitNon-road vehicles",2,"+ (add segment)",null,"Non-road vehicles","Optional",{"$f":"IF(N194=\"NA\",_xlfn.VALUETOTEXT(M194),M194*IF(OR(N194=\"L\", N194=\"kL\"),VLOOKUP(\"F2-\"&Q194,Admin!BN:BT,5,FALSE)*IF(N194=\"kL\",1000,1)*OFFSET(Admin!$AR$3,MATCH(\"MJ\",convSources,0),MATCH(K194,convTargets,0)),IF(N194=\"Kg\",VLOOKUP(\"F2-\"&Q194,Admin!BN:BT,6,FALSE)*OFFSET(Admin!$AR$3,MATCH(\"MJ\",convSources,0),MATCH(K194,convTargets,0)),IF(N194=\"m3\",VLOOKUP(\"F2-\"&Q194,Admin!BN:BT,7,FALSE)*OFFSET(Admin!$AR$3,MATCH(\"Kg\",convSources,0),MATCH(K194,convTargets,0)),OFFSET(Admin!$AR$3,MATCH(N194,convSources,0),MATCH(K194,convTargets,0))))))","v":0},"Tonnes CO2-e","Manual",null,"Tonnes CO2-e","NA",null,"Biodiesel"]
["T3","T3.4","T3","LPG",{"$f":"IFERROR(LEN(B195)-LEN(SUBSTITUTE(B195,\".\",\"\") ),\"BAD VALUE\")","v":1},null,null,"LPG","Optional",{"$f":"IF(N195=\"NA\",_xlfn.VALUETOTEXT(M195),M195*IF(OR(N195=\"L\", N195=\"kL\"),VLOOKUP(\"F2-\"&Q195,Admin!BN:BT,5,FALSE)*IF(N195=\"kL\",1000,1)*OFFSET(Admin!$AR$3,MATCH(\"MJ\",convSources,0),MATCH(K195,convTargets,0)),IF(N195=\"Kg\",VLOOKUP(\"F2-\"&Q195,Admin!BN:BT,6,FALSE)*OFFSET(Admin!$AR$3,MATCH(\"MJ\",convSources,0),MATCH(K195,convTargets,0)),IF(N195=\"m3\",VLOOKUP(\"F2-\"&Q195,Admin!BN:BT,7,FALSE)*OFFSET(Admin!$AR$3,MATCH(\"Kg\",convSources,0),MATCH(K195,convTargets,0)),OFFSET(Admin!$AR$3,MATCH(N195,convSources,0),MATCH(K195,convTargets,0))))))","v":0},"Tonnes CO2-e","Segment Aggregation",{"$f":"SUMIF(C:C,B195,J:J)","v":0},"Tonnes CO2-e","NA",null,"LPG"]
["T3","T3.4.1","T3.4","LPGFRDSegmentSplitRoad vehicles",2,null,null,"Road vehicles","Optional",{"$f":"IF(N196=\"NA\",_xlfn.VALUETOTEXT(M196),M196*IF(OR(N196=\"L\", N196=\"kL\"),VLOOKUP(\"F2-\"&Q196,Admin!BN:BT,5,FALSE)*IF(N196=\"kL\",1000,1)*OFFSET(Admin!$AR$3,MATCH(\"MJ\",convSources,0),MATCH(K196,convTargets,0)),IF(N196=\"Kg\",VLOOKUP(\"F2-\"&Q196,Admin!BN:BT,6,FALSE)*OFFSET(Admin!$AR$3,MATCH(\"MJ\",convSources,0),MATCH(K196,convTargets,0)),IF(N196=\"m3\",VLOOKUP(\"F2-\"&Q196,Admin!BN:BT,7,FALSE)*OFFSET(Admin!$AR$3,MATCH(\"Kg\",convSources,0),MATCH(K196,convTargets,0)),OFFSET(Admin!$AR$3,MATCH(N196,convSources,0),MATCH(K196,convTargets,0))))))","v":0},"Tonnes CO2-e","Auto-Calc",{"$f":"J30 * OFFSET(Admin!$AR$3,MATCH(K30,convSources,0),MATCH(\"GJ\",convTargets,0))  *  IFERROR(VLOOKUP(A196 & \"-\" & Q196,Admin!BN:BQ,4,FALSE),0)","v":0},"Tonnes CO2-e","NA",null,"LPG",null,{"$f":"J30 * OFFSET(Admin!$AR$3,MATCH(K30,convSources,0),MATCH(\"GJ\",convTargets,0))  *  IFERROR(VLOOKUP(A196 & \"-\" & Q196,Admin!BN:CC,14,FALSE),0)","v":0},{"$f":"J30 * OFFSET(Admin!$AR$3,MATCH(K30,convSources,0),MATCH(\"GJ\",convTargets,0))  *  IFERROR(VLOOKUP(A196 & \"-\" & Q196,Admin!BN:CC,15,FALSE),0)","v":0},{"$f":"J30 * OFFSET(Admin!$AR$3,MATCH(K30,convSources,0),MATCH(\"GJ\",convTargets,0))  *  IFERROR(VLOOKUP(A196 & \"-\" & Q196,Admin!BN:CC,16,FALSE),0)","v":0}]
["T3","T3.4.2","T3.4","LPGFRDSegmentSplitNon-road vehicles",2,null,null,"Non-road vehicles","Optional",{"$f":"IF(N197=\"NA\",_xlfn.VALUETOTEXT(M197),M197*IF(OR(N197=\"L\", N197=\"kL\"),VLOOKUP(\"F2-\"&Q197,Admin!BN:BT,5,FALSE)*IF(N197=\"kL\",1000,1)*OFFSET(Admin!$AR$3,MATCH(\"MJ\",convSources,0),MATCH(K197,convTargets,0)),IF(N197=\"Kg\",VLOOKUP(\"F2-\"&Q197,Admin!BN:BT,6,FALSE)*OFFSET(Admin!$AR$3,MATCH(\"MJ\",convSources,0),MATCH(K197,convTargets,0)),IF(N197=\"m3\",VLOOKUP(\"F2-\"&Q197,Admin!BN:BT,7,FALSE)*OFFSET(Admin!$AR$3,MATCH(\"Kg\",convSources,0),MATCH(K197,convTargets,0)),OFFSET(Admin!$AR$3,MATCH(N197,convSources,0),MATCH(K197,convTargets,0))))))","v":0},"Tonnes CO2-e","Auto-Calc",{"$f":"J31 * OFFSET(Admin!$AR$3,MATCH(K31,convSources,0),MATCH(\"GJ\",convTargets,0))  *  IFERROR(VLOOKUP(A197 & \"-\" & Q197,Admin!BN:BQ,4,FALSE),0)","v":0},"Tonnes CO2-e","NA",null,"LPG",null,{"$f":"J31 * OFFSET(Admin!$AR$3,MATCH(K31,convSources,0),MATCH(\"GJ\",convTargets,0))  *  IFERROR(VLOOKUP(A197 & \"-\" & Q197,Admin!BN:CC,14,FALSE),0)","v":0},{"$f":"J31 * OFFSET(Admin!$AR$3,MATCH(K31,convSources,0),MATCH(\"GJ\",convTargets,0))  *  IFERROR(VLOOKUP(A197 & \"-\" & Q197,Admin!BN:CC,15,FALSE),0)","v":0},{"$f":"J31 * OFFSET(Admin!$AR$3,MATCH(K31,convSources,0),MATCH(\"GJ\",convTargets,0))  *  IFERROR(VLOOKUP(A197 & \"-\" & Q197,Admin!BN:CC,16,FALSE),0)","v":0}]
["T3","T3.5","T3","Aviation Fuels",{"$f":"IFERROR(LEN(B198)-LEN(SUBSTITUTE(B198,\".\",\"\") ),\"BAD VALUE\")","v":1},null,null,"Aviation Fuels","Optional",{"$f":"IF(N198=\"NA\",_xlfn.VALUETOTEXT(M198),M198*IF(OR(N198=\"L\", N198=\"kL\"),VLOOKUP(\"F2-\"&Q198,Admin!BN:BT,5,FALSE)*IF(N198=\"kL\",1000,1)*OFFSET(Admin!$AR$3,MATCH(\"MJ\",convSources,0),MATCH(K198,convTargets,0)),IF(N198=\"Kg\",VLOOKUP(\"F2-\"&Q198,Admin!BN:BT,6,FALSE)*OFFSET(Admin!$AR$3,MATCH(\"MJ\",convSources,0),MATCH(K198,convTargets,0)),IF(N198=\"m3\",VLOOKUP(\"F2-\"&Q198,Admin!BN:BT,7,FALSE)*OFFSET(Admin!$AR$3,MATCH(\"Kg\",convSources,0),MATCH(K198,convTargets,0)),OFFSET(Admin!$AR$3,MATCH(N198,convSources,0),MATCH(K198,convTargets,0))))))","v":0},"Tonnes CO2-e","Segment Aggregation",{"$f":"SUMIF(C:C,B198,J:J)","v":0},"Tonnes CO2-e","NA",null,"Aviation Fuels"]
["T3","T3.5.1","T3.5","Aviation FuelsFRDSegmentSplitAvgas",2,null,null,"Avgas","Optional",{"$f":"IF(N199=\"NA\",_xlfn.VALUETOTEXT(M199),M199*IF(OR(N199=\"L\", N199=\"kL\"),VLOOKUP(\"F2-\"&Q199,Admin!BN:BT,5,FALSE)*IF(N199=\"kL\",1000,1)*OFFSET(Admin!$AR$3,MATCH(\"MJ\",convSources,0),MATCH(K199,convTargets,0)),IF(N199=\"Kg\",VLOOKUP(\"F2-\"&Q199,Admin!BN:BT,6,FALSE)*OFFSET(Admin!$AR$3,MATCH(\"MJ\",convSources,0),MATCH(K199,convTargets,0)),IF(N199=\"m3\",VLOOKUP(\"F2-\"&Q199,Admin!BN:BT,7,FALSE)*OFFSET(Admin!$AR$3,MATCH(\"Kg\",convSources,0),MATCH(K199,convTargets,0)),OFFSET(Admin!$AR$3,MATCH(N199,convSources,0),MATCH(K199,convTargets,0))))))","v":0},"Tonnes CO2-e","Segment Aggregation",{"$f":"SUMIF(C:C,B199,J:J)","v":0},"Tonnes CO2-e","NA",null,"Avgas"]
["T3","T3.5.1.1","T3.5.1","Aviation FuelsFRDSegmentSplitAvgasFRDSegmentSplitNon-road vehicles",3,null,null,"Non-road vehicles","Optional",{"$f":"IF(N200=\"NA\",_xlfn.VALUETOTEXT(M200),M200*IF(OR(N200=\"L\", N200=\"kL\"),VLOOKUP(\"F2-\"&Q200,Admin!BN:BT,5,FALSE)*IF(N200=\"kL\",1000,1)*OFFSET(Admin!$AR$3,MATCH(\"MJ\",convSources,0),MATCH(K200,convTargets,0)),IF(N200=\"Kg\",VLOOKUP(\"F2-\"&Q200,Admin!BN:BT,6,FALSE)*OFFSET(Admin!$AR$3,MATCH(\"MJ\",convSources,0),MATCH(K200,convTargets,0)),IF(N200=\"m3\",VLOOKUP(\"F2-\"&Q200,Admin!BN:BT,7,FALSE)*OFFSET(Admin!$AR$3,MATCH(\"Kg\",convSources,0),MATCH(K200,convTargets,0)),OFFSET(Admin!$AR$3,MATCH(N200,convSources,0),MATCH(K200,convTargets,0))))))","v":0},"Tonnes CO2-e","Auto-Calc",{"$f":"J34 * OFFSET(Admin!$AR$3,MATCH(K34,convSources,0),MATCH(\"GJ\",convTargets,0))  *  IFERROR(VLOOKUP(A200 & \"-\" & Q200,Admin!BN:BQ,4,FALSE),0)","v":0},"Tonnes CO2-e","NA",null,"Avgas",null,{"$f":"J34 * OFFSET(Admin!$AR$3,MATCH(K34,convSources,0),MATCH(\"GJ\",convTargets,0))  *  IFERROR(VLOOKUP(A200 & \"-\" & Q200,Admin!BN:CC,14,FALSE),0)","v":0},{"$f":"J34 * OFFSET(Admin!$AR$3,MATCH(K34,convSources,0),MATCH(\"GJ\",convTargets,0))  *  IFERROR(VLOOKUP(A200 & \"-\" & Q200,Admin!BN:CC,15,FALSE),0)","v":0},{"$f":"J34 * OFFSET(Admin!$AR$3,MATCH(K34,convSources,0),MATCH(\"GJ\",convTargets,0))  *  IFERROR(VLOOKUP(A200 & \"-\" & Q200,Admin!BN:CC,16,FALSE),0)","v":0}]
["T3","T3.5.2","T3.5","Aviation FuelsFRDSegmentSplitAviation turbine fuel (ATF)",{"$f":"IFERROR(LEN(B201)-LEN(SUBSTITUTE(B201,\".\",\"\") ),\"BAD VALUE\")","v":2},null,null,"Aviation turbine fuel (ATF)","Optional",{"$f":"IF(N201=\"NA\",_xlfn.VALUETOTEXT(M201),M201*IF(OR(N201=\"L\", N201=\"kL\"),VLOOKUP(\"F2-\"&Q201,Admin!BN:BT,5,FALSE)*IF(N201=\"kL\",1000,1)*OFFSET(Admin!$AR$3,MATCH(\"MJ\",convSources,0),MATCH(K201,convTargets,0)),IF(N201=\"Kg\",VLOOKUP(\"F2-\"&Q201,Admin!BN:BT,6,FALSE)*OFFSET(Admin!$AR$3,MATCH(\"MJ\",convSources,0),MATCH(K201,convTargets,0)),IF(N201=\"m3\",VLOOKUP(\"F2-\"&Q201,Admin!BN:BT,7,FALSE)*OFFSET(Admin!$AR$3,MATCH(\"Kg\",convSources,0),MATCH(K201,convTargets,0)),OFFSET(Admin!$AR$3,MATCH(N201,convSources,0),MATCH(K201,convTargets,0))))))","v":0},"Tonnes CO2-e","Segment Aggregation",{"$f":"SUMIF(C:C,B201,J:J)","v":0},"Tonnes CO2-e","NA",null,"Aviation turbine fuel (ATF)"]
["T3","T3.5.2.1","T3.5.2","Aviation FuelsFRDSegmentSplitAviation turbine fuel (ATF)FRDSegmentSplitNon-road vehicles",3,null,null,"Non-road vehicles","Optional",{"$f":"IF(N202=\"NA\",_xlfn.VALUETOTEXT(M202),M202*IF(OR(N202=\"L\", N202=\"kL\"),VLOOKUP(\"F2-\"&Q202,Admin!BN:BT,5,FALSE)*IF(N202=\"kL\",1000,1)*OFFSET(Admin!$AR$3,MATCH(\"MJ\",convSources,0),MATCH(K202,convTargets,0)),IF(N202=\"Kg\",VLOOKUP(\"F2-\"&Q202,Admin!BN:BT,6,FALSE)*OFFSET(Admin!$AR$3,MATCH(\"MJ\",convSources,0),MATCH(K202,convTargets,0)),IF(N202=\"m3\",VLOOKUP(\"F2-\"&Q202,Admin!BN:BT,7,FALSE)*OFFSET(Admin!$AR$3,MATCH(\"Kg\",convSources,0),MATCH(K202,convTargets,0)),OFFSET(Admin!$AR$3,MATCH(N202,convSources,0),MATCH(K202,convTargets,0))))))","v":0},"Tonnes CO2-e","Auto-Calc",{"$f":"J36 * OFFSET(Admin!$AR$3,MATCH(K36,convSources,0),MATCH(\"GJ\",convTargets,0))  *  IFERROR(VLOOKUP(A202 & \"-\" & Q202,Admin!BN:BQ,4,FALSE),0)","v":0},"Tonnes CO2-e","NA",null,"Aviation turbine fuel (ATF)",null,{"$f":"J36 * OFFSET(Admin!$AR$3,MATCH(K36,convSources,0),MATCH(\"GJ\",convTargets,0))  *  IFERROR(VLOOKUP(A202 & \"-\" & Q202,Admin!BN:CC,14,FALSE),0)","v":0},{"$f":"J36 * OFFSET(Admin!$AR$3,MATCH(K36,convSources,0),MATCH(\"GJ\",convTargets,0))  *  IFERROR(VLOOKUP(A202 & \"-\" & Q202,Admin!BN:CC,15,FALSE),0)","v":0},{"$f":"J36 * OFFSET(Admin!$AR$3,MATCH(K36,convSources,0),MATCH(\"GJ\",convTargets,0))  *  IFERROR(VLOOKUP(A202 & \"-\" & Q202,Admin!BN:CC,16,FALSE),0)","v":0}]
["T3","T3.6","T3","Solid fuel",1,null,null,"Solid fuel","Optional",{"$f":"IF(N203=\"NA\",_xlfn.VALUETOTEXT(M203),M203*IF(OR(N203=\"L\", N203=\"kL\"),VLOOKUP(\"F2-\"&Q203,Admin!BN:BT,5,FALSE)*IF(N203=\"kL\",1000,1)*OFFSET(Admin!$AR$3,MATCH(\"MJ\",convSources,0),MATCH(K203,convTargets,0)),IF(N203=\"Kg\",VLOOKUP(\"F2-\"&Q203,Admin!BN:BT,6,FALSE)*OFFSET(Admin!$AR$3,MATCH(\"MJ\",convSources,0),MATCH(K203,convTargets,0)),IF(N203=\"m3\",VLOOKUP(\"F2-\"&Q203,Admin!BN:BT,7,FALSE)*OFFSET(Admin!$AR$3,MATCH(\"Kg\",convSources,0),MATCH(K203,convTargets,0)),OFFSET(Admin!$AR$3,MATCH(N203,convSources,0),MATCH(K203,convTargets,0))))))","v":0},"Tonnes CO2-e","Segment Aggregation",{"$f":"SUMIF(C:C,B203,J:J)","v":0},"Tonnes CO2-e","NA",null,"Solid fuel"]
["T3","T3.6.1","T3.6","Solid fuelFRDSegmentSplitAnthracite coal",{"$f":"IFERROR(LEN(B204)-LEN(SUBSTITUTE(B204,\".\",\"\") ),\"BAD VALUE\")","v":2},null,null,"Anthracite coal",{"$f":"IF(VLOOKUP(A204,TierIndicators,3,FALSE)=\"Yes\", \"Mandatory\", \"Optional\")","v":"Optional"},{"$f":"IF(N204=\"NA\",_xlfn.VALUETOTEXT(M204),M204*IF(OR(N204=\"L\", N204=\"kL\"),VLOOKUP(\"F2-\"&Q204,Admin!BN:BT,5,FALSE)*IF(N204=\"kL\",1000,1)*OFFSET(Admin!$AR$3,MATCH(\"MJ\",convSources,0),MATCH(K204,convTargets,0)),IF(N204=\"Kg\",VLOOKUP(\"F2-\"&Q204,Admin!BN:BT,6,FALSE)*OFFSET(Admin!$AR$3,MATCH(\"MJ\",convSources,0),MATCH(K204,convTargets,0)),IF(N204=\"m3\",VLOOKUP(\"F2-\"&Q204,Admin!BN:BT,7,FALSE)*OFFSET(Admin!$AR$3,MATCH(\"Kg\",convSources,0),MATCH(K204,convTargets,0)),OFFSET(Admin!$AR$3,MATCH(N204,convSources,0),MATCH(K204,convTargets,0))))))","v":0},"Tonnes CO2-e","Segment Aggregation",{"$f":"SUMIF(C:C,B204,J:J)","v":0},"Tonnes CO2-e",{"$f":"IF(OR(L204=\"Segment Aggregation\",L204=\"Auto-Calc\"),\"NA\",IF(AND(I204=\"Mandatory\",OR(M204=\"\",N204=\"\")), \"FAIL\", IF(I204=\"Optional\",\"NA\",\"PASS\")))","v":"NA"},null,"Anthracite coal"]
["T3","T3.6.1.1","T3.6.1","Solid fuelFRDSegmentSplitAnthracite coalFRDSegmentSplitRoad vehicles",3,null,null,"Road vehicles","Optional",{"$f":"IF(N205=\"NA\",_xlfn.VALUETOTEXT(M205),M205*IF(OR(N205=\"L\", N205=\"kL\"),VLOOKUP(\"F2-\"&Q205,Admin!BN:BT,5,FALSE)*IF(N205=\"kL\",1000,1)*OFFSET(Admin!$AR$3,MATCH(\"MJ\",convSources,0),MATCH(K205,convTargets,0)),IF(N205=\"Kg\",VLOOKUP(\"F2-\"&Q205,Admin!BN:BT,6,FALSE)*OFFSET(Admin!$AR$3,MATCH(\"MJ\",convSources,0),MATCH(K205,convTargets,0)),IF(N205=\"m3\",VLOOKUP(\"F2-\"&Q205,Admin!BN:BT,7,FALSE)*OFFSET(Admin!$AR$3,MATCH(\"Kg\",convSources,0),MATCH(K205,convTargets,0)),OFFSET(Admin!$AR$3,MATCH(N205,convSources,0),MATCH(K205,convTargets,0))))))","v":0},"Tonnes CO2-e","Auto-Calc",{"$f":"J39 * OFFSET(Admin!$AR$3,MATCH(K39,convSources,0),MATCH(\"GJ\",convTargets,0))  *  IFERROR(VLOOKUP(A205 & \"-\" & Q205,Admin!BN:BQ,4,FALSE),0)","v":0},"Tonnes CO2-e","NA",null,"Anthracite coal",null,{"$f":"J39 * OFFSET(Admin!$AR$3,MATCH(K39,convSources,0),MATCH(\"GJ\",convTargets,0))  *  IFERROR(VLOOKUP(A205 & \"-\" & Q205,Admin!BN:CC,14,FALSE),0)","v":0},{"$f":"J39 * OFFSET(Admin!$AR$3,MATCH(K39,convSources,0),MATCH(\"GJ\",convTargets,0))  *  IFERROR(VLOOKUP(A205 & \"-\" & Q205,Admin!BN:CC,15,FALSE),0)","v":0},{"$f":"J39 * OFFSET(Admin!$AR$3,MATCH(K39,convSources,0),MATCH(\"GJ\",convTargets,0))  *  IFERROR(VLOOKUP(A205 & \"-\" & Q205,Admin!BN:CC,16,FALSE),0)","v":0}]
["T3","T3.6.1.2","T3.6.1","Solid fuelFRDSegmentSplitAnthracite coalFRDSegmentSplitNon-road vehicles",3,null,null,"Non-road vehicles","Optional",{"$f":"IF(N206=\"NA\",_xlfn.VALUETOTEXT(M206),M206*IF(OR(N206=\"L\", N206=\"kL\"),VLOOKUP(\"F2-\"&Q206,Admin!BN:BT,5,FALSE)*IF(N206=\"kL\",1000,1)*OFFSET(Admin!$AR$3,MATCH(\"MJ\",convSources,0),MATCH(K206,convTargets,0)),IF(N206=\"Kg\",VLOOKUP(\"F2-\"&Q206,Admin!BN:BT,6,FALSE)*OFFSET(Admin!$AR$3,MATCH(\"MJ\",convSources,0),MATCH(K206,convTargets,0)),IF(N206=\"m3\",VLOOKUP(\"F2-\"&Q206,Admin!BN:BT,7,FALSE)*OFFSET(Admin!$AR$3,MATCH(\"Kg\",convSources,0),MATCH(K206,convTargets,0)),OFFSET(Admin!$AR$3,MATCH(N206,convSources,0),MATCH(K206,convTargets,0))))))","v":0},"Tonnes CO2-e","Auto-Calc",{"$f":"J40 * OFFSET(Admin!$AR$3,MATCH(K40,convSources,0),MATCH(\"GJ\",convTargets,0))  *  IFERROR(VLOOKUP(A206 & \"-\" & Q206,Admin!BN:BQ,4,FALSE),0)","v":0},"Tonnes CO2-e","NA",null,"Anthracite coal",null,{"$f":"J40 * OFFSET(Admin!$AR$3,MATCH(K40,convSources,0),MATCH(\"GJ\",convTargets,0))  *  IFERROR(VLOOKUP(A206 & \"-\" & Q206,Admin!BN:CC,14,FALSE),0)","v":0},{"$f":"J40 * OFFSET(Admin!$AR$3,MATCH(K40,convSources,0),MATCH(\"GJ\",convTargets,0))  *  IFERROR(VLOOKUP(A206 & \"-\" & Q206,Admin!BN:CC,15,FALSE),0)","v":0},{"$f":"J40 * OFFSET(Admin!$AR$3,MATCH(K40,convSources,0),MATCH(\"GJ\",convTargets,0))  *  IFERROR(VLOOKUP(A206 & \"-\" & Q206,Admin!BN:CC,16,FALSE),0)","v":0}]
["T3","T3.6.2","T3.6","Solid fuelFRDSegmentSplitBituminous coal",2,null,null,"Bituminous coal","Optional",{"$f":"IF(N207=\"NA\",_xlfn.VALUETOTEXT(M207),M207*IF(OR(N207=\"L\", N207=\"kL\"),VLOOKUP(\"F2-\"&Q207,Admin!BN:BT,5,FALSE)*IF(N207=\"kL\",1000,1)*OFFSET(Admin!$AR$3,MATCH(\"MJ\",convSources,0),MATCH(K207,convTargets,0)),IF(N207=\"Kg\",VLOOKUP(\"F2-\"&Q207,Admin!BN:BT,6,FALSE)*OFFSET(Admin!$AR$3,MATCH(\"MJ\",convSources,0),MATCH(K207,convTargets,0)),IF(N207=\"m3\",VLOOKUP(\"F2-\"&Q207,Admin!BN:BT,7,FALSE)*OFFSET(Admin!$AR$3,MATCH(\"Kg\",convSources,0),MATCH(K207,convTargets,0)),OFFSET(Admin!$AR$3,MATCH(N207,convSources,0),MATCH(K207,convTargets,0))))))","v":0},"Tonnes CO2-e","Segment Aggregation",{"$f":"SUMIF(C:C,B207,J:J)","v":0},"Tonnes CO2-e","NA",null,"Bituminous coal"]
["T3","T3.6.2.1","T3.6.2","Solid fuelFRDSegmentSplitBituminous coalFRDSegmentSplitRoad vehicles",3,null,null,"Road vehicles","Optional",{"$f":"IF(N208=\"NA\",_xlfn.VALUETOTEXT(M208),M208*IF(OR(N208=\"L\", N208=\"kL\"),VLOOKUP(\"F2-\"&Q208,Admin!BN:BT,5,FALSE)*IF(N208=\"kL\",1000,1)*OFFSET(Admin!$AR$3,MATCH(\"MJ\",convSources,0),MATCH(K208,convTargets,0)),IF(N208=\"Kg\",VLOOKUP(\"F2-\"&Q208,Admin!BN:BT,6,FALSE)*OFFSET(Admin!$AR$3,MATCH(\"MJ\",convSources,0),MATCH(K208,convTargets,0)),IF(N208=\"m3\",VLOOKUP(\"F2-\"&Q208,Admin!BN:BT,7,FALSE)*OFFSET(Admin!$AR$3,MATCH(\"Kg\",convSources,0),MATCH(K208,convTargets,0)),OFFSET(Admin!$AR$3,MATCH(N208,convSources,0),MATCH(K208,convTargets,0))))))","v":0},"Tonnes CO2-e","Auto-Calc",{"$f":"J42 * OFFSET(Admin!$AR$3,MATCH(K42,convSources,0),MATCH(\"GJ\",convTargets,0))  *  IFERROR(VLOOKUP(A208 & \"-\" & Q208,Admin!BN:BQ,4,FALSE),0)","v":0},"Tonnes CO2-e","NA",null,"Bituminous coal",null,{"$f":"J42 * OFFSET(Admin!$AR$3,MATCH(K42,convSources,0),MATCH(\"GJ\",convTargets,0))  *  IFERROR(VLOOKUP(A208 & \"-\" & Q208,Admin!BN:CC,14,FALSE),0)","v":0},{"$f":"J42 * OFFSET(Admin!$AR$3,MATCH(K42,convSources,0),MATCH(\"GJ\",convTargets,0))  *  IFERROR(VLOOKUP(A208 & \"-\" & Q208,Admin!BN:CC,15,FALSE),0)","v":0},{"$f":"J42 * OFFSET(Admin!$AR$3,MATCH(K42,convSources,0),MATCH(\"GJ\",convTargets,0))  *  IFERROR(VLOOKUP(A208 & \"-\" & Q208,Admin!BN:CC,16,FALSE),0)","v":0}]
["T3","T3.6.2.2","T3.6.2","Solid fuelFRDSegmentSplitBituminous coalFRDSegmentSplitNon-road vehicles",3,null,null,"Non-road vehicles","Optional",{"$f":"IF(N209=\"NA\",_xlfn.VALUETOTEXT(M209),M209*IF(OR(N209=\"L\", N209=\"kL\"),VLOOKUP(\"F2-\"&Q209,Admin!BN:BT,5,FALSE)*IF(N209=\"kL\",1000,1)*OFFSET(Admin!$AR$3,MATCH(\"MJ\",convSources,0),MATCH(K209,convTargets,0)),IF(N209=\"Kg\",VLOOKUP(\"F2-\"&Q209,Admin!BN:BT,6,FALSE)*OFFSET(Admin!$AR$3,MATCH(\"MJ\",convSources,0),MATCH(K209,convTargets,0)),IF(N209=\"m3\",VLOOKUP(\"F2-\"&Q209,Admin!BN:BT,7,FALSE)*OFFSET(Admin!$AR$3,MATCH(\"Kg\",convSources,0),MATCH(K209,convTargets,0)),OFFSET(Admin!$AR$3,MATCH(N209,convSources,0),MATCH(K209,convTargets,0))))))","v":0},"Tonnes CO2-e","Auto-Calc",{"$f":"J43 * OFFSET(Admin!$AR$3,MATCH(K43,convSources,0),MATCH(\"GJ\",convTargets,0))  *  IFERROR(VLOOKUP(A209 & \"-\" & Q209,Admin!BN:BQ,4,FALSE),0)","v":0},"Tonnes CO2-e","NA",null,"Bituminous coal",null,{"$f":"J43 * OFFSET(Admin!$AR$3,MATCH(K43,convSources,0),MATCH(\"GJ\",convTargets,0))  *  IFERROR(VLOOKUP(A209 & \"-\" & Q209,Admin!BN:CC,14,FALSE),0)","v":0},{"$f":"J43 * OFFSET(Admin!$AR$3,MATCH(K43,convSources,0),MATCH(\"GJ\",convTargets,0))  *  IFERROR(VLOOKUP(A209 & \"-\" & Q209,Admin!BN:CC,15,FALSE),0)","v":0},{"$f":"J43 * OFFSET(Admin!$AR$3,MATCH(K43,convSources,0),MATCH(\"GJ\",convTargets,0))  *  IFERROR(VLOOKUP(A209 & \"-\" & Q209,Admin!BN:CC,16,FALSE),0)","v":0}]
["T3","T3.6.3","T3.6","Solid fuelFRDSegmentSplitCoal Briquettes",2,null,null,"Coal Briquettes","Optional",{"$f":"IF(N210=\"NA\",_xlfn.VALUETOTEXT(M210),M210*IF(OR(N210=\"L\", N210=\"kL\"),VLOOKUP(\"F2-\"&Q210,Admin!BN:BT,5,FALSE)*IF(N210=\"kL\",1000,1)*OFFSET(Admin!$AR$3,MATCH(\"MJ\",convSources,0),MATCH(K210,convTargets,0)),IF(N210=\"Kg\",VLOOKUP(\"F2-\"&Q210,Admin!BN:BT,6,FALSE)*OFFSET(Admin!$AR$3,MATCH(\"MJ\",convSources,0),MATCH(K210,convTargets,0)),IF(N210=\"m3\",VLOOKUP(\"F2-\"&Q210,Admin!BN:BT,7,FALSE)*OFFSET(Admin!$AR$3,MATCH(\"Kg\",convSources,0),MATCH(K210,convTargets,0)),OFFSET(Admin!$AR$3,MATCH(N210,convSources,0),MATCH(K210,convTargets,0))))))","v":0},"Tonnes CO2-e","Segment Aggregation",{"$f":"SUMIF(C:C,B210,J:J)","v":0},"Tonnes CO2-e","NA",null,"Coal Briquettes"]
["T3","T3.6.3.1","T3.6.3","Solid fuelFRDSegmentSplitCoal BriquettesFRDSegmentSplitRoad vehicles",3,null,null,"Road vehicles","Optional",{"$f":"IF(N211=\"NA\",_xlfn.VALUETOTEXT(M211),M211*IF(OR(N211=\"L\", N211=\"kL\"),VLOOKUP(\"F2-\"&Q211,Admin!BN:BT,5,FALSE)*IF(N211=\"kL\",1000,1)*OFFSET(Admin!$AR$3,MATCH(\"MJ\",convSources,0),MATCH(K211,convTargets,0)),IF(N211=\"Kg\",VLOOKUP(\"F2-\"&Q211,Admin!BN:BT,6,FALSE)*OFFSET(Admin!$AR$3,MATCH(\"MJ\",convSources,0),MATCH(K211,convTargets,0)),IF(N211=\"m3\",VLOOKUP(\"F2-\"&Q211,Admin!BN:BT,7,FALSE)*OFFSET(Admin!$AR$3,MATCH(\"Kg\",convSources,0),MATCH(K211,convTargets,0)),OFFSET(Admin!$AR$3,MATCH(N211,convSources,0),MATCH(K211,convTargets,0))))))","v":0},"Tonnes CO2-e","Auto-Calc",{"$f":"J45 * OFFSET(Admin!$AR$3,MATCH(K45,convSources,0),MATCH(\"GJ\",convTargets,0))  *  IFERROR(VLOOKUP(A211 & \"-\" & Q211,Admin!BN:BQ,4,FALSE),0)","v":0},"Tonnes CO2-e","NA",null,"Coal Briquettes",null,{"$f":"J45 * OFFSET(Admin!$AR$3,MATCH(K45,convSources,0),MATCH(\"GJ\",convTargets,0))  *  IFERROR(VLOOKUP(A211 & \"-\" & Q211,Admin!BN:CC,14,FALSE),0)","v":0},{"$f":"J45 * OFFSET(Admin!$AR$3,MATCH(K45,convSources,0),MATCH(\"GJ\",convTargets,0))  *  IFERROR(VLOOKUP(A211 & \"-\" & Q211,Admin!BN:CC,15,FALSE),0)","v":0},{"$f":"J45 * OFFSET(Admin!$AR$3,MATCH(K45,convSources,0),MATCH(\"GJ\",convTargets,0))  *  IFERROR(VLOOKUP(A211 & \"-\" & Q211,Admin!BN:CC,16,FALSE),0)","v":0}]
["T3","T3.6.3.2","T3.6.3","Solid fuelFRDSegmentSplitCoal BriquettesFRDSegmentSplitNon-road vehicles",3,null,null,"Non-road vehicles","Optional",{"$f":"IF(N212=\"NA\",_xlfn.VALUETOTEXT(M212),M212*IF(OR(N212=\"L\", N212=\"kL\"),VLOOKUP(\"F2-\"&Q212,Admin!BN:BT,5,FALSE)*IF(N212=\"kL\",1000,1)*OFFSET(Admin!$AR$3,MATCH(\"MJ\",convSources,0),MATCH(K212,convTargets,0)),IF(N212=\"Kg\",VLOOKUP(\"F2-\"&Q212,Admin!BN:BT,6,FALSE)*OFFSET(Admin!$AR$3,MATCH(\"MJ\",convSources,0),MATCH(K212,convTargets,0)),IF(N212=\"m3\",VLOOKUP(\"F2-\"&Q212,Admin!BN:BT,7,FALSE)*OFFSET(Admin!$AR$3,MATCH(\"Kg\",convSources,0),MATCH(K212,convTargets,0)),OFFSET(Admin!$AR$3,MATCH(N212,convSources,0),MATCH(K212,convTargets,0))))))","v":0},"Tonnes CO2-e","Auto-Calc",{"$f":"J46 * OFFSET(Admin!$AR$3,MATCH(K46,convSources,0),MATCH(\"GJ\",convTargets,0))  *  IFERROR(VLOOKUP(A212 & \"-\" & Q212,Admin!BN:BQ,4,FALSE),0)","v":0},"Tonnes CO2-e","NA",null,"Coal Briquettes",null,{"$f":"J46 * OFFSET(Admin!$AR$3,MATCH(K46,convSources,0),MATCH(\"GJ\",convTargets,0))  *  IFERROR(VLOOKUP(A212 & \"-\" & Q212,Admin!BN:CC,14,FALSE),0)","v":0},{"$f":"J46 * OFFSET(Admin!$AR$3,MATCH(K46,convSources,0),MATCH(\"GJ\",convTargets,0))  *  IFERROR(VLOOKUP(A212 & \"-\" & Q212,Admin!BN:CC,15,FALSE),0)","v":0},{"$f":"J46 * OFFSET(Admin!$AR$3,MATCH(K46,convSources,0),MATCH(\"GJ\",convTargets,0))  *  IFERROR(VLOOKUP(A212 & \"-\" & Q212,Admin!BN:CC,16,FALSE),0)","v":0}]
["T3","T3.7","T3","Hydrogen",{"$f":"IFERROR(LEN(B213)-LEN(SUBSTITUTE(B213,\".\",\"\") ),\"BAD VALUE\")","v":1},null,null,"Hydrogen","Optional",{"$f":"IF(N213=\"NA\",_xlfn.VALUETOTEXT(M213),M213*IF(OR(N213=\"L\", N213=\"kL\"),VLOOKUP(\"F2-\"&Q213,Admin!BN:BT,5,FALSE)*IF(N213=\"kL\",1000,1)*OFFSET(Admin!$AR$3,MATCH(\"MJ\",convSources,0),MATCH(K213,convTargets,0)),IF(N213=\"Kg\",VLOOKUP(\"F2-\"&Q213,Admin!BN:BT,6,FALSE)*OFFSET(Admin!$AR$3,MATCH(\"MJ\",convSources,0),MATCH(K213,convTargets,0)),IF(N213=\"m3\",VLOOKUP(\"F2-\"&Q213,Admin!BN:BT,7,FALSE)*OFFSET(Admin!$AR$3,MATCH(\"Kg\",convSources,0),MATCH(K213,convTargets,0)),OFFSET(Admin!$AR$3,MATCH(N213,convSources,0),MATCH(K213,convTargets,0))))))","v":0},"Tonnes CO2-e","Segment Aggregation",{"$f":"SUMIF(C:C,B213,J:J)","v":0},"Tonnes CO2-e","NA",null,"Hydrogen"]
["T3","T3.7.1","T3.7","HydrogenFRDSegmentSplitRoad vehicles",2,"+ (add segment)",null,"Road vehicles","Optional",{"$f":"IF(N214=\"NA\",_xlfn.VALUETOTEXT(M214),M214*IF(OR(N214=\"L\", N214=\"kL\"),VLOOKUP(\"F2-\"&Q214,Admin!BN:BT,5,FALSE)*IF(N214=\"kL\",1000,1)*OFFSET(Admin!$AR$3,MATCH(\"MJ\",convSources,0),MATCH(K214,convTargets,0)),IF(N214=\"Kg\",VLOOKUP(\"F2-\"&Q214,Admin!BN:BT,6,FALSE)*OFFSET(Admin!$AR$3,MATCH(\"MJ\",convSources,0),MATCH(K214,convTargets,0)),IF(N214=\"m3\",VLOOKUP(\"F2-\"&Q214,Admin!BN:BT,7,FALSE)*OFFSET(Admin!$AR$3,MATCH(\"Kg\",convSources,0),MATCH(K214,convTargets,0)),OFFSET(Admin!$AR$3,MATCH(N214,convSources,0),MATCH(K214,convTargets,0))))))","v":0},"Tonnes CO2-e","Manual",null,"Tonnes CO2-e","NA",null,"Hydrogen"]
["T3","T3.7.2","T3.7","HydrogenFRDSegmentSplitNon-road vehicles",2,"+ (add segment)",null,"Non-road vehicles","Optional",{"$f":"IF(N215=\"NA\",_xlfn.VALUETOTEXT(M215),M215*IF(OR(N215=\"L\", N215=\"kL\"),VLOOKUP(\"F2-\"&Q215,Admin!BN:BT,5,FALSE)*IF(N215=\"kL\",1000,1)*OFFSET(Admin!$AR$3,MATCH(\"MJ\",convSources,0),MATCH(K215,convTargets,0)),IF(N215=\"Kg\",VLOOKUP(\"F2-\"&Q215,Admin!BN:BT,6,FALSE)*OFFSET(Admin!$AR$3,MATCH(\"MJ\",convSources,0),MATCH(K215,convTargets,0)),IF(N215=\"m3\",VLOOKUP(\"F2-\"&Q215,Admin!BN:BT,7,FALSE)*OFFSET(Admin!$AR$3,MATCH(\"Kg\",convSources,0),MATCH(K215,convTargets,0)),OFFSET(Admin!$AR$3,MATCH(N215,convSources,0),MATCH(K215,convTargets,0))))))","v":0},"Tonnes CO2-e","Manual",null,"Tonnes CO2-e","NA",null,"Hydrogen"]
["T3","T3.8","T3","Electricity",{"$f":"IFERROR(LEN(B216)-LEN(SUBSTITUTE(B216,\".\",\"\") ),\"BAD VALUE\")","v":1},null,null,"Electricity","Optional",{"$f":"IF(N216=\"NA\",_xlfn.VALUETOTEXT(M216),M216*IF(OR(N216=\"L\", N216=\"kL\"),VLOOKUP(\"F2-\"&Q216,Admin!BN:BT,5,FALSE)*IF(N216=\"kL\",1000,1)*OFFSET(Admin!$AR$3,MATCH(\"MJ\",convSources,0),MATCH(K216,convTargets,0)),IF(N216=\"Kg\",VLOOKUP(\"F2-\"&Q216,Admin!BN:BT,6,FALSE)*OFFSET(Admin!$AR$3,MATCH(\"MJ\",convSources,0),MATCH(K216,convTargets,0)),IF(N216=\"m3\",VLOOKUP(\"F2-\"&Q216,Admin!BN:BT,7,FALSE)*OFFSET(Admin!$AR$3,MATCH(\"Kg\",convSources,0),MATCH(K216,convTargets,0)),OFFSET(Admin!$AR$3,MATCH(N216,convSources,0),MATCH(K216,convTargets,0))))))","v":0},"Tonnes CO2-e","Segment Aggregation",{"$f":"SUMIF(C:C,B216,J:J)","v":0},"Tonnes CO2-e","NA",null,"Electricity"]
["T3","T3.8.1","T3.8","ElectricityFRDSegmentSplitused at Victorian Government facilities",2,null,null,"used at Victorian Government facilities","Optional",{"$f":"IF(N217=\"NA\",_xlfn.VALUETOTEXT(M217),M217*IF(OR(N217=\"L\", N217=\"kL\"),VLOOKUP(\"F2-\"&Q217,Admin!BN:BT,5,FALSE)*IF(N217=\"kL\",1000,1)*OFFSET(Admin!$AR$3,MATCH(\"MJ\",convSources,0),MATCH(K217,convTargets,0)),IF(N217=\"Kg\",VLOOKUP(\"F2-\"&Q217,Admin!BN:BT,6,FALSE)*OFFSET(Admin!$AR$3,MATCH(\"MJ\",convSources,0),MATCH(K217,convTargets,0)),IF(N217=\"m3\",VLOOKUP(\"F2-\"&Q217,Admin!BN:BT,7,FALSE)*OFFSET(Admin!$AR$3,MATCH(\"Kg\",convSources,0),MATCH(K217,convTargets,0)),OFFSET(Admin!$AR$3,MATCH(N217,convSources,0),MATCH(K217,convTargets,0))))))","v":0},"Tonnes CO2-e","Segment Aggregation",{"$f":"SUMIF(C:C,B217,J:J)","v":0},"Tonnes CO2-e","NA",null,"Electricity"]
["T3","T3.8.1.1","T3.8.1","ElectricityFRDSegmentSplitused at Victorian Government facilitiesFRDSegmentSplitRoad vehicles",3,null,null,"Road vehicles","Optional",{"$f":"IF(N218=\"NA\",_xlfn.VALUETOTEXT(M218),M218*IF(OR(N218=\"L\", N218=\"kL\"),VLOOKUP(\"F2-\"&Q218,Admin!BN:BT,5,FALSE)*IF(N218=\"kL\",1000,1)*OFFSET(Admin!$AR$3,MATCH(\"MJ\",convSources,0),MATCH(K218,convTargets,0)),IF(N218=\"Kg\",VLOOKUP(\"F2-\"&Q218,Admin!BN:BT,6,FALSE)*OFFSET(Admin!$AR$3,MATCH(\"MJ\",convSources,0),MATCH(K218,convTargets,0)),IF(N218=\"m3\",VLOOKUP(\"F2-\"&Q218,Admin!BN:BT,7,FALSE)*OFFSET(Admin!$AR$3,MATCH(\"Kg\",convSources,0),MATCH(K218,convTargets,0)),OFFSET(Admin!$AR$3,MATCH(N218,convSources,0),MATCH(K218,convTargets,0))))))","v":0},"Tonnes CO2-e","Auto-Calc",{"$f":"J52 * OFFSET(Admin!$AR$3,MATCH(K52,convSources,0),MATCH(\"KWh\",convTargets,0))  *  IFERROR(VLOOKUP(A218 & \"-\" & Q218,Admin!BN:BQ,4,FALSE),0)","v":0},"Tonnes CO2-e","NA",null,"Electricity",null,{"$f":"IFERROR(J52 * OFFSET(Admin!$AR$3,MATCH(K52,convSources,0),MATCH(\"KWh\",convTargets,0))  *  IFERROR(VLOOKUP(A218 & \"-\" & Q218,Admin!BN:CC,14,FALSE),0),\"NA\")","v":"NA"},{"$f":"IFERROR(J52 * OFFSET(Admin!$AR$3,MATCH(K52,convSources,0),MATCH(\"KWh\",convTargets,0))  *  IFERROR(VLOOKUP(A218 & \"-\" & Q218,Admin!BN:CC,15,FALSE),0),\"NA\")","v":"NA"},{"$f":"IFERROR(J52 * OFFSET(Admin!$AR$3,MATCH(K52,convSources,0),MATCH(\"KWh\",convTargets,0))  *  IFERROR(VLOOKUP(A218 & \"-\" & Q218,Admin!BN:CC,16,FALSE),0),\"NA\")","v":"NA"}]
["T3","T3.8.1.2","T3.8.1","ElectricityFRDSegmentSplitused at Victorian Government facilitiesFRDSegmentSplitNon-road vehicles",3,null,null,"Non-road vehicles","Optional",{"$f":"IF(N219=\"NA\",_xlfn.VALUETOTEXT(M219),M219*IF(OR(N219=\"L\", N219=\"kL\"),VLOOKUP(\"F2-\"&Q219,Admin!BN:BT,5,FALSE)*IF(N219=\"kL\",1000,1)*OFFSET(Admin!$AR$3,MATCH(\"MJ\",convSources,0),MATCH(K219,convTargets,0)),IF(N219=\"Kg\",VLOOKUP(\"F2-\"&Q219,Admin!BN:BT,6,FALSE)*OFFSET(Admin!$AR$3,MATCH(\"MJ\",convSources,0),MATCH(K219,convTargets,0)),IF(N219=\"m3\",VLOOKUP(\"F2-\"&Q219,Admin!BN:BT,7,FALSE)*OFFSET(Admin!$AR$3,MATCH(\"Kg\",convSources,0),MATCH(K219,convTargets,0)),OFFSET(Admin!$AR$3,MATCH(N219,convSources,0),MATCH(K219,convTargets,0))))))","v":0},"Tonnes CO2-e","Auto-Calc",{"$f":"J53 * OFFSET(Admin!$AR$3,MATCH(K53,convSources,0),MATCH(\"KWh\",convTargets,0))  *  IFERROR(VLOOKUP(A219 & \"-\" & Q219,Admin!BN:BQ,4,FALSE),0)","v":0},"Tonnes CO2-e","NA",null,"Electricity",null,{"$f":"IFERROR(J53 * OFFSET(Admin!$AR$3,MATCH(K53,convSources,0),MATCH(\"KWh\",convTargets,0))  *  IFERROR(VLOOKUP(A219 & \"-\" & Q219,Admin!BN:CC,14,FALSE),0),\"NA\")","v":"NA"},{"$f":"IFERROR(J53 * OFFSET(Admin!$AR$3,MATCH(K53,convSources,0),MATCH(\"KWh\",convTargets,0))  *  IFERROR(VLOOKUP(A219 & \"-\" & Q219,Admin!BN:CC,15,FALSE),0),\"NA\")","v":"NA"},{"$f":"IFERROR(J53 * OFFSET(Admin!$AR$3,MATCH(K53,convSources,0),MATCH(\"KWh\",convTargets,0))  *  IFERROR(VLOOKUP(A219 & \"-\" & Q219,Admin!BN:CC,16,FALSE),0),\"NA\")","v":"NA"}]
["T3","T3.8.2","T3.8","ElectricityFRDSegmentSplitused from other public or private chargers",2,null,null,"used from other public or private chargers","Optional",{"$f":"IF(N220=\"NA\",_xlfn.VALUETOTEXT(M220),M220*IF(OR(N220=\"L\", N220=\"kL\"),VLOOKUP(\"F2-\"&Q220,Admin!BN:BT,5,FALSE)*IF(N220=\"kL\",1000,1)*OFFSET(Admin!$AR$3,MATCH(\"MJ\",convSources,0),MATCH(K220,convTargets,0)),IF(N220=\"Kg\",VLOOKUP(\"F2-\"&Q220,Admin!BN:BT,6,FALSE)*OFFSET(Admin!$AR$3,MATCH(\"MJ\",convSources,0),MATCH(K220,convTargets,0)),IF(N220=\"m3\",VLOOKUP(\"F2-\"&Q220,Admin!BN:BT,7,FALSE)*OFFSET(Admin!$AR$3,MATCH(\"Kg\",convSources,0),MATCH(K220,convTargets,0)),OFFSET(Admin!$AR$3,MATCH(N220,convSources,0),MATCH(K220,convTargets,0))))))","v":0},"Tonnes CO2-e","Segment Aggregation",{"$f":"SUMIF(C:C,B220,J:J)","v":0},"Tonnes CO2-e","NA",null,"Electricity"]
["T3","T3.8.2.1","T3.8.2","ElectricityFRDSegmentSplitused from other public or private chargersFRDSegmentSplitRoad vehicles",3,null,null,"Road vehicles","Optional",{"$f":"IF(N221=\"NA\",_xlfn.VALUETOTEXT(M221),M221*IF(OR(N221=\"L\", N221=\"kL\"),VLOOKUP(\"F2-\"&Q221,Admin!BN:BT,5,FALSE)*IF(N221=\"kL\",1000,1)*OFFSET(Admin!$AR$3,MATCH(\"MJ\",convSources,0),MATCH(K221,convTargets,0)),IF(N221=\"Kg\",VLOOKUP(\"F2-\"&Q221,Admin!BN:BT,6,FALSE)*OFFSET(Admin!$AR$3,MATCH(\"MJ\",convSources,0),MATCH(K221,convTargets,0)),IF(N221=\"m3\",VLOOKUP(\"F2-\"&Q221,Admin!BN:BT,7,FALSE)*OFFSET(Admin!$AR$3,MATCH(\"Kg\",convSources,0),MATCH(K221,convTargets,0)),OFFSET(Admin!$AR$3,MATCH(N221,convSources,0),MATCH(K221,convTargets,0))))))","v":0},"Tonnes CO2-e","Auto-Calc",{"$f":"J55 * OFFSET(Admin!$AR$3,MATCH(K55,convSources,0),MATCH(\"KWh\",convTargets,0))  *  IFERROR(VLOOKUP(A221 & \"-\" & Q221,Admin!BN:BQ,4,FALSE),0)","v":0},"Tonnes CO2-e","NA",null,"Electricity",null,{"$f":"IFERROR(J55 * OFFSET(Admin!$AR$3,MATCH(K55,convSources,0),MATCH(\"KWh\",convTargets,0))  *  IFERROR(VLOOKUP(A221 & \"-\" & Q221,Admin!BN:CC,14,FALSE),0),\"NA\")","v":"NA"},{"$f":"IFERROR(J55 * OFFSET(Admin!$AR$3,MATCH(K55,convSources,0),MATCH(\"KWh\",convTargets,0))  *  IFERROR(VLOOKUP(A221 & \"-\" & Q221,Admin!BN:CC,15,FALSE),0),\"NA\")","v":"NA"},{"$f":"IFERROR(J55 * OFFSET(Admin!$AR$3,MATCH(K55,convSources,0),MATCH(\"KWh\",convTargets,0))  *  IFERROR(VLOOKUP(A221 & \"-\" & Q221,Admin!BN:CC,16,FALSE),0),\"NA\")","v":"NA"}]
["T3","T3.8.2.2","T3.8.2","ElectricityFRDSegmentSplitused from other public or private chargersFRDSegmentSplitNon-road vehicles",3,null,null,"Non-road vehicles","Optional",{"$f":"IF(N222=\"NA\",_xlfn.VALUETOTEXT(M222),M222*IF(OR(N222=\"L\", N222=\"kL\"),VLOOKUP(\"F2-\"&Q222,Admin!BN:BT,5,FALSE)*IF(N222=\"kL\",1000,1)*OFFSET(Admin!$AR$3,MATCH(\"MJ\",convSources,0),MATCH(K222,convTargets,0)),IF(N222=\"Kg\",VLOOKUP(\"F2-\"&Q222,Admin!BN:BT,6,FALSE)*OFFSET(Admin!$AR$3,MATCH(\"MJ\",convSources,0),MATCH(K222,convTargets,0)),IF(N222=\"m3\",VLOOKUP(\"F2-\"&Q222,Admin!BN:BT,7,FALSE)*OFFSET(Admin!$AR$3,MATCH(\"Kg\",convSources,0),MATCH(K222,convTargets,0)),OFFSET(Admin!$AR$3,MATCH(N222,convSources,0),MATCH(K222,convTargets,0))))))","v":0},"Tonnes CO2-e","Auto-Calc",{"$f":"J56 * OFFSET(Admin!$AR$3,MATCH(K56,convSources,0),MATCH(\"KWh\",convTargets,0))  *  IFERROR(VLOOKUP(A222 & \"-\" & Q222,Admin!BN:BQ,4,FALSE),0)","v":0},"Tonnes CO2-e","NA",null,"Electricity",null,{"$f":"IFERROR(J56 * OFFSET(Admin!$AR$3,MATCH(K56,convSources,0),MATCH(\"KWh\",convTargets,0))  *  IFERROR(VLOOKUP(A222 & \"-\" & Q222,Admin!BN:CC,14,FALSE),0),\"NA\")","v":"NA"},{"$f":"IFERROR(J56 * OFFSET(Admin!$AR$3,MATCH(K56,convSources,0),MATCH(\"KWh\",convTargets,0))  *  IFERROR(VLOOKUP(A222 & \"-\" & Q222,Admin!BN:CC,15,FALSE),0),\"NA\")","v":"NA"},{"$f":"IFERROR(J56 * OFFSET(Admin!$AR$3,MATCH(K56,convSources,0),MATCH(\"KWh\",convTargets,0))  *  IFERROR(VLOOKUP(A222 & \"-\" & Q222,Admin!BN:CC,16,FALSE),0),\"NA\")","v":"NA"}]
[]
[]
[null,"T4","Total distance travelled by commercial air travel (passenger km travelled for business purposes by entity staff on commercial or charter aircraft)"]
[null,"ID","Parent ID","FRDSegment","Segment Level",null,null,"Description","Flag","Final Value","Final Unit","Input Type","Input Value","Input Unit","CHECK"]
["T4","T4","NA",{"$f":"IF(E227=1,H227,IFERROR(VLOOKUP(C227,$B$14:$D$1048576,3,FALSE)&\"FRDSegmentSplit\"&H227,H227))","v":"GRAND TOTAL"},{"$f":"IFERROR(LEN(B227)-LEN(SUBSTITUTE(B227,\".\",\"\") ),\"BAD VALUE\")","v":0},null,null,"GRAND TOTAL",{"$f":"IF(VLOOKUP(A227,TierIndicators,3,FALSE)=\"Yes\", \"Mandatory\", \"Optional\")","v":"Optional"},{"$f":"IF(N227=\"NA\", _xlfn.VALUETOTEXT(M227), M227*OFFSET(Admin!$AR$3,MATCH(N227,convSources,0),MATCH(K227,convTargets,0)))","v":0},"Km","Segment Aggregation",{"$f":"SUMIF(C:C,B227,J:J)","v":0},"Km",{"$f":"IF(OR(L227=\"Segment Aggregation\",L227=\"Auto-Calc\"),\"NA\",IF(AND(I227=\"Mandatory\",OR(M227=\"\",N227=\"\")), \"FAIL\", IF(I227=\"Optional\",\"NA\",\"PASS\")))","v":"NA"}]
["T4","T4.1","T4",{"$f":"IF(E228=1,H228,IFERROR(VLOOKUP(C228,$B$14:$D$1048576,3,FALSE)&\"FRDSegmentSplit\"&H228,H228))","v":"Total distance travelled by commercial air travel (passenger km travelled for business purposes by entity staff on commercial or charter aircraft)\n"},{"$f":"IFERROR(LEN(B228)-LEN(SUBSTITUTE(B228,\".\",\"\") ),\"BAD VALUE\")","v":1},"+ (add segment)",null,"Total distance travelled by commercial air travel (passenger km travelled for business purposes by entity staff on commercial or charter aircraft)\n",{"$f":"IF(VLOOKUP(A228,TierIndicators,3,FALSE)=\"Yes\", \"Mandatory\", \"Optional\")","v":"Optional"},{"$f":"IF(N228=\"NA\", _xlfn.VALUETOTEXT(M228), M228*OFFSET(Admin!$AR$3,MATCH(N228,convSources,0),MATCH(K228,convTargets,0)))","v":0},"Km","Manual",null,"Km","NA",null,null,null,null,null,null,{"$f":"IF(VLOOKUP(A228,Calculations,MATCH(\"data imported?\",Admin!$Q$2:$V$2,0),0),\"calculation available\",\"import data from home tab to use calculations\")","v":"import data from home tab to use calculations"}]

{"sheet":"Total Energy Use","index":11,"n_rows":38,"n_cols":17,"rows_kept":38,"cut":false,"hidden":false,"merged":[[5,1,5,6],[25,2,25,12],[32,2,32,12],[12,2,12,12],[19,2,19,12]]}
[]
[]
[]
[]
[]
[null,{"$f":"Agency&\" | \"&Tier&\" | \"&ReportingPeriod","v":" |  |  - "}]
[]
[null,"<- Back to Home",null,null,null,"Sheet complete:",null,{"$f":"IFERROR(IF(COUNTIF(O:O,\"Pass\")+COUNTIF(O:O,\"FAIL\")=0,\"NA\",IF(VLOOKUP(\"FAIL\",O:O,1,FALSE) = \"FAIL\", IF(COUNTIF(O:O,\"Pass\")=0,\"Not Started\",\"In Progress\"),\"Complete\")),\"Complete\")","v":"NA"}," "]
[null,null,null,null,null,null,null,{"$f":"IF(NOT(OR(H8=\"Complete\",H8=\"NA\")),\"*Mandatory values have not been entered, revisit highlighted items\",\"\")","v":""}]
[null,"Total Energy Use - Reporting"]
[]
[]
[null,"E1","Total energy usage from fuels, including stationary fuels (F1) and transport fuels (T1)"]
[null,"ID","Parent ID","FRDSegment","Segment Level",null,null,"Description","Flag","Final Value","Final Unit","Input Type","Input Value","Input Unit","CHECK"]
["E1","E1","NA",{"$f":"IF(E15=1,H15,IFERROR(VLOOKUP(C15,$B$14:$D$1048576,3,FALSE)&\"FRDSegmentSplit\"&H15,H15))","v":"GRAND TOTAL"},{"$f":"IFERROR(LEN(B15)-LEN(SUBSTITUTE(B15,\".\",\"\") ),\"BAD VALUE\")","v":0},null,null,"GRAND TOTAL",{"$f":"IF(VLOOKUP(A15,TierIndicators,3,FALSE)=\"Yes\", \"Mandatory\", \"Optional\")","v":"Optional"},{"$f":"IF(N15=\"NA\", _xlfn.VALUETOTEXT(M15), M15*OFFSET(Admin!$AR$3,MATCH(N15,convSources,0),MATCH(K15,convTargets,0)))","v":0},"MJ","Segment Aggregation",{"$f":"SUMIF(C:C,B15,J:J)","v":0},"MJ",{"$f":"IF(OR(L15=\"Segment Aggregation\",L15=\"Auto-Calc\"),\"NA\",IF(AND(I15=\"Mandatory\",OR(M15=\"\",N15=\"\")), \"FAIL\", IF(I15=\"Optional\",\"NA\",\"PASS\")))","v":"NA"},null,"GRAND TOTAL"]
["E1","E1.1","E1",{"$f":"IF(E16=1,H16,IFERROR(VLOOKUP(C16,$B$14:$D$1048576,3,FALSE)&\"FRDSegmentSplit\"&H16,H16))","v":"Total energy usage from stationary fuels (F1)"},{"$f":"IFERROR(LEN(B16)-LEN(SUBSTITUTE(B16,\".\",\"\") ),\"BAD VALUE\")","v":1},null,null,"Total energy usage from stationary fuels (F1)",{"$f":"IF(VLOOKUP(A16,TierIndicators,3,FALSE)=\"Yes\", \"Mandatory\", \"Optional\")","v":"Optional"},{"$f":"IF(N16=\"NA\", _xlfn.VALUETOTEXT(M16), M16*OFFSET(Admin!$AR$3,MATCH(N16,convSources,0),MATCH(K16,convTargets,0)))","v":0},"MJ","Auto-Calc",{"$f":"'Stationary Fuel Use'!M15","v":0},{"$f":"'Stationary Fuel Use'!N15","v":"MJ"},"NA",null,"Total energy usage from fuels (F1)"]
["E1","E1.2","E1",{"$f":"IF(E17=1,H17,IFERROR(VLOOKUP(C17,$B$14:$D$1048576,3,FALSE)&\"FRDSegmentSplit\"&H17,H17))","v":"Total energy usage from transport (T1)"},{"$f":"IFERROR(LEN(B17)-LEN(SUBSTITUTE(B17,\".\",\"\") ),\"BAD VALUE\")","v":1},null,null,"Total energy usage from transport (T1)",{"$f":"IF(VLOOKUP(A17,TierIndicators,3,FALSE)=\"Yes\", \"Mandatory\", \"Optional\")","v":"Optional"},{"$f":"IF(N17=\"NA\", _xlfn.VALUETOTEXT(M17), M17*OFFSET(Admin!$AR$3,MATCH(N17,convSources,0),MATCH(K17,convTargets,0)))","v":0},"MJ","Auto-Calc",{"$f":"Transportation!M15-(Transportation!J51*OFFSET(Admin!$AR$3,MATCH(Transportation!K51,convSources,0),MATCH(\"MJ\",convTargets,0)))","v":0},{"$f":"Transportation!N15","v":"MJ"},"NA",null,"Total energy usage from transport (T1)"]
[]
[]
[null,"E2","Total energy usage from electricity"]
[null,"ID","Parent ID","FRDSegment","Segment Level",null,null,"Description","Flag","Final Value","Final Unit","Input Type","Input Value","Input Unit","CHECK"]
["E2","E2","NA",{"$f":"IF(E22=1,H22,IFERROR(VLOOKUP(C22,$B$14:$D$1048576,3,FALSE)&\"FRDSegmentSplit\"&H22,H22))","v":"GRAND TOTAL"},{"$f":"IFERROR(LEN(B22)-LEN(SUBSTITUTE(B22,\".\",\"\") ),\"BAD VALUE\")","v":0},null,null,"GRAND TOTAL",{"$f":"IF(VLOOKUP(A22,TierIndicators,3,FALSE)=\"Yes\", \"Mandatory\", \"Optional\")","v":"Optional"},{"$f":"IF(N22=\"NA\", _xlfn.VALUETOTEXT(M22), M22*OFFSET(Admin!$AR$3,MATCH(N22,convSources,0),MATCH(K22,convTargets,0)))","v":0},"MJ","Segment Aggregation",{"$f":"SUMIF(C:C,B22,J:J)","v":0},"MJ",{"$f":"IF(OR(L22=\"Segment Aggregation\",L22=\"Auto-Calc\"),\"NA\",IF(AND(I22=\"Mandatory\",OR(M22=\"\",N22=\"\")), \"FAIL\", IF(I22=\"Optional\",\"NA\",\"PASS\")))","v":"NA"},null,"GRAND TOTAL"]
["E2","E2.1","E2",{"$f":"IF(E23=1,H23,IFERROR(VLOOKUP(C23,$B$14:$D$1048576,3,FALSE)&\"FRDSegmentSplit\"&H23,H23))","v":"Total energy usage from electricity (EL1)"},{"$f":"IFERROR(LEN(B23)-LEN(SUBSTITUTE(B23,\".\",\"\") ),\"BAD VALUE\")","v":1},null,null,"Total energy usage from electricity (EL1)",{"$f":"IF(VLOOKUP(A23,TierIndicators,3,FALSE)=\"Yes\", \"Mandatory\", \"Optional\")","v":"Optional"},{"$f":"IF(N23=\"NA\", _xlfn.VALUETOTEXT(M23), M23*OFFSET(Admin!$AR$3,MATCH(N23,convSources,0),MATCH(K23,convTargets,0)))","v":0},"MJ","Auto-Calc",{"$f":"'Electricity Use'!M15-'Electricity Use'!J30-'Electricity Use'!J31","v":0},{"$f":"'Electricity Use'!N15","v":"MWh"},"NA",null,"Total energy usage from electricity (EL1)"]
[]
[]
[null,"E3","Total energy usage segmented by renewable and non-renewable sources"]
[null,"ID","Parent ID","FRDSegment","Segment Level",null,null,"Description","Flag","Final Value","Final Unit","Input Type","Input Value","Input Unit","CHECK"]
["E3","E3","NA",{"$f":"IF(E28=1,H28,IFERROR(VLOOKUP(C28,$B$14:$D$1048576,3,FALSE)&\"FRDSegmentSplit\"&H28,H28))","v":"GRAND TOTAL"},{"$f":"IFERROR(LEN(B28)-LEN(SUBSTITUTE(B28,\".\",\"\") ),\"BAD VALUE\")","v":0},null,null,"GRAND TOTAL",{"$f":"IF(VLOOKUP(A28,TierIndicators,3,FALSE)=\"Yes\", \"Mandatory\", \"Optional\")","v":"Optional"},{"$f":"IF(N28=\"NA\", _xlfn.VALUETOTEXT(M28), M28*OFFSET(Admin!$AR$3,MATCH(N28,convSources,0),MATCH(K28,convTargets,0)))","v":0},"MJ","Segment Aggregation",{"$f":"SUMIF(C:C,B28,J:J)","v":0},"MJ",{"$f":"IF(OR(L28=\"Segment Aggregation\",L28=\"Auto-Calc\"),\"NA\",IF(AND(I28=\"Mandatory\",OR(M28=\"\",N28=\"\")), \"FAIL\", IF(I28=\"Optional\",\"NA\",\"PASS\")))","v":"NA"},null,"GRAND TOTAL"]
["E3","E3.1","E3",{"$f":"IF(E29=1,H29,IFERROR(VLOOKUP(C29,$B$14:$D$1048576,3,FALSE)&\"FRDSegmentSplit\"&H29,H29))","v":"Renewable"},{"$f":"IFERROR(LEN(B29)-LEN(SUBSTITUTE(B29,\".\",\"\") ),\"BAD VALUE\")","v":1},null,null,"Renewable",{"$f":"IF(VLOOKUP(A29,TierIndicators,3,FALSE)=\"Yes\", \"Mandatory\", \"Optional\")","v":"Optional"},{"$f":"IF(N29=\"NA\", _xlfn.VALUETOTEXT(M29), M29*OFFSET(Admin!$AR$3,MATCH(N29,convSources,0),MATCH(K29,convTargets,0)))","v":0},"MJ","Auto-Calc",{"$f":"'Market-based calc'!C15*OFFSET(Admin!$AR$3,MATCH(\"KWh\",convSources,0),MATCH(\"MJ\",convTargets,0))\n+IF(AND('Stationary Fuel Use'!M56=0,NOT(ISBLANK('Stationary Fuel Use'!M56))),'Stationary Fuel Use'!J21+'Stationary Fuel Use'!J37,0)\n+IF(AND(Transportation!M193=0,NOT(ISBLANK(Transportation!M193))),Transportation!J27,0)+IF(AND(Transportation!M194=0,NOT(ISBLANK(Transportation!M194))),Transportation!J28,0)\n+IF(AND(Transportation!M214=0,NOT(ISBLANK(Transportation!M214))),Transportation!J48,0)+IF(AND(Transportation!M215=0,NOT(ISBLANK(Transportation!M215))),Transportation!J49,0)","v":0},"MJ","NA",null,"Renewable"]
["E3","E3.2","E3",{"$f":"IF(E30=1,H30,IFERROR(VLOOKUP(C30,$B$14:$D$1048576,3,FALSE)&\"FRDSegmentSplit\"&H30,H30))","v":"Non-Renewable"},{"$f":"IFERROR(LEN(B30)-LEN(SUBSTITUTE(B30,\".\",\"\") ),\"BAD VALUE\")","v":1},null,null,"Non-Renewable",{"$f":"IF(VLOOKUP(A30,TierIndicators,3,FALSE)=\"Yes\", \"Mandatory\", \"Optional\")","v":"Optional"},{"$f":"IF(N30=\"NA\", _xlfn.VALUETOTEXT(M30), M30*OFFSET(Admin!$AR$3,MATCH(N30,convSources,0),MATCH(K30,convTargets,0)))","v":0},"MJ","Auto-Calc",{"$f":"SUM(M15,M22)-M29","v":0},"MJ","NA",null,"Non-Renewable"]
[]
[]
[null,"E4","Units of energy used normalised"]
[null,"ID","Parent ID","FRDSegment","Segment Level",null,null,"Description","Flag","Final Value","Final Unit","Input Type","Input Value","Input Unit","CHECK"]
["E4","E4","NA",{"$f":"IF(E35=1,H35,IFERROR(VLOOKUP(C35,$B$14:$D$1048576,3,FALSE)&\"FRDSegmentSplit\"&H35,H35))","v":"GRAND TOTAL"},{"$f":"IFERROR(LEN(B35)-LEN(SUBSTITUTE(B35,\".\",\"\") ),\"BAD VALUE\")","v":0},null,null,"GRAND TOTAL",{"$f":"IF(VLOOKUP(A35,TierIndicators,3,FALSE)=\"Yes\", \"Mandatory\", \"Optional\")","v":"Optional"},{"$f":"M35","v":0},"MJ","Auto-Calc",{"$f":"IFERROR(J28/M37,0)","v":0},"MJ",{"$f":"IF(OR(L35=\"Segment Aggregation\",L35=\"Auto-Calc\"),\"NA\",IF(AND(I35=\"Mandatory\",OR(M35=\"\",N35=\"\")), \"FAIL\", IF(I35=\"Optional\",\"NA\",\"PASS\")))","v":"NA"},null,"GRAND TOTAL"]
["E4","E4.1","E4",{"$f":"IF(E36=1,H36,IFERROR(VLOOKUP(C36,$B$14:$D$1048576,3,FALSE)&\"FRDSegmentSplit\"&H36,H36))","v":"Normalisation Factor"},{"$f":"IFERROR(LEN(B36)-LEN(SUBSTITUTE(B36,\".\",\"\") ),\"BAD VALUE\")","v":1},null,null,"Normalisation Factor",{"$f":"IF(VLOOKUP(A36,TierIndicators,3,FALSE)=\"Yes\", \"Mandatory\", \"Optional\")","v":"Optional"},{"$f":"M36","v":0},"Text","Dropdown",null,"Text","NA",null,"Normalisation Factor"]
["E4","E4.2","E4",{"$f":"IF(E37=1,H37,IFERROR(VLOOKUP(C37,$B$14:$D$1048576,3,FALSE)&\"FRDSegmentSplit\"&H37,H37))","v":"Normalisation Factor Value"},{"$f":"IFERROR(LEN(B37)-LEN(SUBSTITUTE(B37,\".\",\"\") ),\"BAD VALUE\")","v":1},null,null,"Normalisation Factor Value",{"$f":"IF(VLOOKUP(A37,TierIndicators,3,FALSE)=\"Yes\", \"Mandatory\", \"Optional\")","v":"Optional"},{"$f":"M37","v":0},"Qty","Manual",null,"Qty","NA",null,"Normalisation Factor Value"]
["E4","E4.3","E4",{"$f":"IF(E38=1,H38,IFERROR(VLOOKUP(C38,$B$14:$D$1048576,3,FALSE)&\"FRDSegmentSplit\"&H38,H38))","v":"Normalisation Factor Description - provide if selected \"other\" as factor"},{"$f":"IFERROR(LEN(B38)-LEN(SUBSTITUTE(B38,\".\",\"\") ),\"BAD VALUE\")","v":1},null,null,"Normalisation Factor Description - provide if selected \"other\" as factor","Optional",{"$f":"M38","v":0},"Text","Text",null,"Text","NA",null,"Normalisation Factor Description - provide if selected \"Other\" as factor"]

{"sheet":"Sust.Buildings & Infrastructure","index":12,"n_rows":34,"n_cols":17,"rows_kept":34,"cut":false,"hidden":false,"merged":[[5,1,5,6],[31,2,31,12],[12,2,12,12],[20,2,20,12]]}
[]
[]
[]
[]
[]
[null,{"$f":"Agency&\" | \"&Tier&\" | \"&ReportingPeriod","v":" |  |  - "}]
[]
[null,"<- Back to Home",null,null,null,"Sheet complete:",null,{"$f":"IFERROR(IF(COUNTIF(O:O,\"Pass\")+COUNTIF(O:O,\"FAIL\")=0,\"NA\",IF(VLOOKUP(\"FAIL\",O:O,1,FALSE) = \"FAIL\", IF(COUNTIF(O:O,\"Pass\")=0,\"Not Started\",\"In Progress\"),\"Complete\")),\"Complete\")","v":"NA"}," "]
[null,null,null,null,null,null,null,{"$f":"IF(NOT(OR(H8=\"Complete\",H8=\"NA\")),\"*Mandatory values have not been entered, revisit highlighted items\",\"\")","v":""}]
[null,"Sustainable Buildings and Infrastructure - Reporting"]
[]
[]
[null,"B3","NABERS Energy (National Australian Built Environment Rating system) ratings of newly completed/occupied Entity-owned office buildings and substantial tenancy fit-outs (itemised)"]
[null,"ID","Parent ID","FRDSegment","Segment Level",null,null,"Description","Flag","Final Value","Final Unit","Input Type","Input Value","Input Unit","CHECK"]
["B3","B3.1","B3",{"$f":"IF(E15=1,H15,IFERROR(VLOOKUP(C15,$B$14:$D$1048576,3,FALSE)&\"FRDSegmentSplit\"&H15,H15))","v":"New Building, Owned (Report NABERS Energy Rating of office accommodation)"},{"$f":"IFERROR(LEN(B15)-LEN(SUBSTITUTE(B15,\".\",\"\") ),\"BAD VALUE\")","v":1},"+ (add segment)",null,"New Building, Owned (Report NABERS Energy Rating of office accommodation)",{"$f":"IF(VLOOKUP(A15,TierIndicators,3,FALSE)=\"Yes\", \"Mandatory\", \"Optional\")","v":"Optional"},{"$f":"M15","v":"No aggregation"},"NA",null,"No aggregation","NA","NA",null,"New Building, Owned (Report NABERS Energy Rating of office accommodation)"]
["B3",{"$f":"C16 & \".\" & COUNTIF($C$1:OFFSET(C16,-1,0),C16) +1","v":"B3.1.1"},"B3.1",{"$f":"IF(E16=1,H16,IFERROR(VLOOKUP(C16,$B$14:$D$1048576,3,FALSE)&\"FRDSegmentSplit\"&H16,H16))","v":"New Building, Owned (Report NABERS Energy Rating of office accommodation)FRDSegmentSplitExample Building 1"},{"$f":"IFERROR(LEN(B16)-LEN(SUBSTITUTE(B16,\".\",\"\") ),\"BAD VALUE\")","v":2},null,"- (delete)","Example Building 1",{"$f":"IF(VLOOKUP(A16,TierIndicators,3,FALSE)=\"Yes\", \"Mandatory\", \"Optional\")","v":"Optional"},{"$f":"M16","v":0},"NA","Manual",null,"NA",{"$f":"IF(OR(L16=\"Segment Aggregation\",L16=\"Auto-Calc\"),\"NA\",IF(AND(I16=\"Mandatory\",OR(M16=\"\",N16=\"\")), \"FAIL\", IF(I16=\"Optional\",\"NA\",\"PASS\")))","v":"NA"},null,"Example Building 1"]
["B3","B3.2","B3",{"$f":"IF(E17=1,H17,IFERROR(VLOOKUP(C17,$B$14:$D$1048576,3,FALSE)&\"FRDSegmentSplit\"&H17,H17))","v":"Existing Building, Leased (Report Tenancy NABERS Energy Rating if a substantial fit-out is done by the entity)"},{"$f":"IFERROR(LEN(B17)-LEN(SUBSTITUTE(B17,\".\",\"\") ),\"BAD VALUE\")","v":1},"+ (add segment)",null,"Existing Building, Leased (Report Tenancy NABERS Energy Rating if a substantial fit-out is done by the entity)",{"$f":"IF(VLOOKUP(A17,TierIndicators,3,FALSE)=\"Yes\", \"Mandatory\", \"Optional\")","v":"Optional"},{"$f":"M17","v":"No aggregation"},"NA",null,"No aggregation","NA","NA",null,"Existing Building, Leased (Report Tenancy NABERS Energy Rating if a substantial fit-out is done by the entity)"]
["B3",{"$f":"C18 & \".\" & COUNTIF($C$1:OFFSET(C18,-1,0),C18) +1","v":"B3.2.1"},"B3.2",{"$f":"IF(E18=1,H18,IFERROR(VLOOKUP(C18,$B$14:$D$1048576,3,FALSE)&\"FRDSegmentSplit\"&H18,H18))","v":"Existing Building, Leased (Report Tenancy NABERS Energy Rating if a substantial fit-out is done by the entity)FRDSegmentSplitExample Building 2"},{"$f":"IFERROR(LEN(B18)-LEN(SUBSTITUTE(B18,\".\",\"\") ),\"BAD VALUE\")","v":2},null,"- (delete)","Example Building 2",{"$f":"IF(VLOOKUP(A18,TierIndicators,3,FALSE)=\"Yes\", \"Mandatory\", \"Optional\")","v":"Optional"},{"$f":"M18","v":0},"NA","Manual",null,"NA","NA",null,"Example Building 2"]
[]
[]
[null,"B4","Environmental performance ratings (eg. NABERS, Green Star, or ISCAIS rating scheme) of newly completed Entity-owned non-office building or infrastructure projects or upgrades with a value over $1 million"]
[null,"ID","Parent ID","FRDSegment","Segment Level",null,null,"Description","Flag","Final Value","Final Unit","Input Type","Input Value","Input Unit","CHECK"]
["B4","B4.1","B4",{"$f":"IF(E23=1,H23,IFERROR(VLOOKUP(C23,$B$14:$D$1048576,3,FALSE)&\"FRDSegmentSplit\"&H23,H23))","v":"Rating scheme"},{"$f":"IFERROR(LEN(B23)-LEN(SUBSTITUTE(B23,\".\",\"\") ),\"BAD VALUE\")","v":1},"+ (add segment)",null,"Rating scheme",{"$f":"IF(VLOOKUP(A23,TierIndicators,3,FALSE)=\"Yes\", \"Mandatory\", \"Optional\")","v":"Optional"},{"$f":"M23","v":"No aggregation"},"NA",null,"No aggregation","NA",{"$f":"IF(OR(L23=\"Segment Aggregation\",L23=\"Auto-Calc\"),\"NA\",IF(AND(I23=\"Mandatory\",OR(M23=\"\",N23=\"\")), \"FAIL\", IF(I23=\"Optional\",\"NA\",\"PASS\")))","v":"NA"},null,"Rating scheme"]
["B4","B4.1.1","B4.1","Rating schemeFRDSegmentSplitNABERS Energy",2,"+ (add segment)",null,"NABERS Energy","Optional",{"$f":"M24","v":"No aggregation"},"NA",null,"No aggregation","NA","NA",null,"NABERS"]
["B4","B4.1.1.1","B4.1.1","Rating schemeFRDSegmentSplitNABERS EnergyFRDSegmentSplitExample Building 1",3,"+ (add segment)","- (delete)","Example Building 1","Optional",{"$f":"M25","v":0},"NA","Manual",null,"NA","NA",null,"Example Building 1"]
["B4","B4.1.2","B4.1","Rating schemeFRDSegmentSplitGreen Star Communities",2,"+ (add segment)",null,"Green Star Communities","Optional","No aggregation","NA",null,"No aggregation","NA","NA",null,"Green Star"]
["B4","B4.1.2.1","B4.1.2","Rating schemeFRDSegmentSplitGreen Star CommunitiesFRDSegmentSplitExample Building 2",3,"+ (add segment)","- (delete)","Example Building 2","Optional",0,"NA","Manual",null,"NA","NA",null,"Example Building 2"]
["B4","B4.1.3","B4.1","Rating schemeFRDSegmentSplitISCA - Infrastructure Sustainability rating ",2,"+ (add segment)",null,"ISCA - Infrastructure Sustainability rating ","Optional","No aggregation","NA",null,"No aggregation","NA","NA",null,"ISCA IS"]
["B4",{"$f":"C29 & \".\" & COUNTIF($C$1:OFFSET(C29,-1,0),C29) +1","v":"B4.1.3.1"},"B4.1.3","Rating schemeFRDSegmentSplitISCA - Infrastructure Sustainability rating FRDSegmentSplitExample Building 3",{"$f":"IFERROR(LEN(B29)-LEN(SUBSTITUTE(B29,\".\",\"\") ),\"BAD VALUE\")","v":3},"+ (add segment)","- (delete)","Example Building 3",{"$f":"IF(VLOOKUP(A29,TierIndicators,3,FALSE)=\"Yes\", \"Mandatory\", \"Optional\")","v":"Optional"},{"$f":"M29","v":0},"NA","Manual",null,"NA","NA",null,"ISCA IS"]
[]
[]
[null,"B5","Environmental performance ratings achieved for Entity-owned assets portfolio segmented by rating scheme and building, facility, or infrastructure type, where these ratings have been conducted"]
[null,"ID","Parent ID","FRDSegment","Segment Level",null,null,"Description","Flag","Final Value","Final Unit","Input Type","Input Value","Input Unit","CHECK"]
["B5","B5.1","B5",{"$f":"IF(E34=1,H34,IFERROR(VLOOKUP(C34,$B$14:$D$1048576,3,FALSE)&\"FRDSegmentSplit\"&H34,H34))","v":"Rating scheme"},{"$f":"IFERROR(LEN(B34)-LEN(SUBSTITUTE(B34,\".\",\"\") ),\"BAD VALUE\")","v":1},"+ (add segment)",null,"Rating scheme",{"$f":"IF(VLOOKUP(A34,TierIndicators,3,FALSE)=\"Yes\", \"Mandatory\", \"Optional\")","v":"Optional"},{"$f":"M34","v":"No aggregation"},"NA",null,"No aggregation","NA",{"$f":"IF(OR(L34=\"Segment Aggregation\",L34=\"Auto-Calc\"),\"NA\",IF(AND(I34=\"Mandatory\",OR(M34=\"\",N34=\"\")), \"FAIL\", IF(I34=\"Optional\",\"NA\",\"PASS\")))","v":"NA"},null,"Rating scheme"]

{"sheet":"Water Use","index":13,"n_rows":27,"n_cols":17,"rows_kept":27,"cut":false,"hidden":false,"merged":[[5,1,5,6],[21,2,21,12],[12,2,12,12]]}
[]
[]
[]
[]
[]
[null,{"$f":"Agency&\" | \"&Tier&\" | \"&ReportingPeriod","v":" |  |  - "}]
[]
[null,"<- Back to Home",null,null,null,"Sheet complete:",null,{"$f":"IFERROR(IF(COUNTIF(O:O,\"Pass\")+COUNTIF(O:O,\"FAIL\")=0,\"NA\",IF(VLOOKUP(\"FAIL\",O:O,1,FALSE) = \"FAIL\", IF(COUNTIF(O:O,\"Pass\")=0,\"Not Started\",\"In Progress\"),\"Complete\")),\"Complete\")","v":"NA"}," "]
[null,null,null,null,null,null,null,{"$f":"IF(NOT(OR(H8=\"Complete\",H8=\"NA\")),\"*Mandatory values have not been entered, revisit highlighted items\",\"\")","v":""}]
[null,"Water Use - Reporting"]
[]
[]
[null,"W1","Total units of metered water consumed by water source"]
[null,"ID","Parent ID","FRDSegment","Segment Level",null,null,"Description","Flag","Final Value","Final Unit","Input Type","Input Value","Input Unit","CHECK"]
["W1","W1","NA",{"$f":"IF(E15=1,H15,IFERROR(VLOOKUP(C15,$B$14:$D$1048576,3,FALSE)&\"FRDSegmentSplit\"&H15,H15))","v":"GRAND TOTAL"},{"$f":"IFERROR(LEN(B15)-LEN(SUBSTITUTE(B15,\".\",\"\") ),\"BAD VALUE\")","v":0},null,null,"GRAND TOTAL",{"$f":"IF(VLOOKUP(A15,TierIndicators,3,FALSE)=\"Yes\", \"Mandatory\", \"Optional\")","v":"Optional"},{"$f":"IF(N15=\"NA\", _xlfn.VALUETOTEXT(M15), M15*OFFSET(Admin!$AR$3,MATCH(N15,convSources,0),MATCH(K15,convTargets,0)))","v":0},"kL (water)","Segment Aggregation",{"$f":"SUMIF(C:C,B15,J:J)","v":0},"kL (water)",{"$f":"IF(OR(L15=\"Segment Aggregation\",L15=\"Auto-Calc\"),\"NA\",IF(AND(I15=\"Mandatory\",OR(M15=\"\",N15=\"\")), \"FAIL\", IF(I15=\"Optional\",\"NA\",\"PASS\")))","v":"NA"},null,"GRAND TOTAL"]
["W1","W1.1","W1",{"$f":"IF(E16=1,H16,IFERROR(VLOOKUP(C16,$B$14:$D$1048576,3,FALSE)&\"FRDSegmentSplit\"&H16,H16))","v":"Potable water consumption (from town water supply)"},{"$f":"IFERROR(LEN(B16)-LEN(SUBSTITUTE(B16,\".\",\"\") ),\"BAD VALUE\")","v":1},"+ (add segment)",null,"Potable water consumption (from town water supply)",{"$f":"IF(VLOOKUP(A16,TierIndicators,3,FALSE)=\"Yes\", \"Mandatory\", \"Optional\")","v":"Optional"},{"$f":"IF(N16=\"NA\", _xlfn.VALUETOTEXT(M16), M16*OFFSET(Admin!$AR$3,MATCH(N16,convSources,0),MATCH(K16,convTargets,0)))","v":0},"kL (water)","Manual",null,"kL (water)","NA",null,"Potable water consumption (from town water supply)"]
["W1","W1.2","W1",{"$f":"IF(E17=1,H17,IFERROR(VLOOKUP(C17,$B$14:$D$1048576,3,FALSE)&\"FRDSegmentSplit\"&H17,H17))","v":"Metered rainwater collection consumption "},{"$f":"IFERROR(LEN(B17)-LEN(SUBSTITUTE(B17,\".\",\"\") ),\"BAD VALUE\")","v":1},"+ (add segment)",null,"Metered rainwater collection consumption ",{"$f":"IF(VLOOKUP(A17,TierIndicators,3,FALSE)=\"Yes\", \"Mandatory\", \"Optional\")","v":"Optional"},{"$f":"IF(N17=\"NA\", _xlfn.VALUETOTEXT(M17), M17*OFFSET(Admin!$AR$3,MATCH(N17,convSources,0),MATCH(K17,convTargets,0)))","v":0},"kL (water)","Manual",null,"kL (water)","NA",null,"Metered rainwater collection consumption "]
["W1","W1.3","W1",{"$f":"IF(E18=1,H18,IFERROR(VLOOKUP(C18,$B$14:$D$1048576,3,FALSE)&\"FRDSegmentSplit\"&H18,H18))","v":"Metered alternate supply consumption (eg. River, stream, aquifer, bore, fire supply, third pipe etc)"},{"$f":"IFERROR(LEN(B18)-LEN(SUBSTITUTE(B18,\".\",\"\") ),\"BAD VALUE\")","v":1},"+ (add segment)",null,"Metered alternate supply consumption (eg. River, stream, aquifer, bore, fire supply, third pipe etc)",{"$f":"IF(VLOOKUP(A18,TierIndicators,3,FALSE)=\"Yes\", \"Mandatory\", \"Optional\")","v":"Optional"},{"$f":"IF(N18=\"NA\", _xlfn.VALUETOTEXT(M18), M18*OFFSET(Admin!$AR$3,MATCH(N18,convSources,0),MATCH(K18,convTargets,0)))","v":0},"kL (water)","Manual",null,"kL (water)","NA",null,"Metered alternate supply consumption (eg. River, stream, aquifer, bore, fire supply, third pipe etc)"]
["W1","W1.4","W1",{"$f":"IF(E19=1,H19,IFERROR(VLOOKUP(C19,$B$14:$D$1048576,3,FALSE)&\"FRDSegmentSplit\"&H19,H19))","v":"Metered reused water consumption (eg. Grey or black water)"},{"$f":"IFERROR(LEN(B19)-LEN(SUBSTITUTE(B19,\".\",\"\") ),\"BAD VALUE\")","v":1},"+ (add segment)",null,"Metered reused water consumption (eg. Grey or black water)",{"$f":"IF(VLOOKUP(A19,TierIndicators,3,FALSE)=\"Yes\", \"Mandatory\", \"Optional\")","v":"Optional"},{"$f":"IF(N19=\"NA\", _xlfn.VALUETOTEXT(M19), M19*OFFSET(Admin!$AR$3,MATCH(N19,convSources,0),MATCH(K19,convTargets,0)))","v":0},"kL (water)","Manual",null,"kL (water)","NA",null,"Metered reused water consumption (eg. Grey or black water)"]
[]
[]
[null,"W2","Units of metered water consumed normalised by FTE, headcount, floor area, or other entity or sector specific quantity"]
[null,"ID","Parent ID","FRDSegment","Segment Level",null,null,"Description","Flag","Final Value","Final Unit","Input Type","Input Value","Input Unit","CHECK"]
["W2","W2","NA",{"$f":"IF(E24=1,H24,IFERROR(VLOOKUP(C24,$B$14:$D$1048576,3,FALSE)&\"FRDSegmentSplit\"&H24,H24))","v":"GRAND TOTAL"},{"$f":"IFERROR(LEN(B24)-LEN(SUBSTITUTE(B24,\".\",\"\") ),\"BAD VALUE\")","v":0},null,null,"GRAND TOTAL",{"$f":"IF(VLOOKUP(A24,TierIndicators,3,FALSE)=\"Yes\", \"Mandatory\", \"Optional\")","v":"Optional"},{"$f":"M24","v":0},"kL (water)","Auto-Calc",{"$f":"IFERROR(J15/M26,0)","v":0},"kL (water)",{"$f":"IF(OR(L24=\"Segment Aggregation\",L24=\"Auto-Calc\"),\"NA\",IF(AND(I24=\"Mandatory\",OR(M24=\"\",N24=\"\")), \"FAIL\", IF(I24=\"Optional\",\"NA\",\"PASS\")))","v":"NA"},null,"GRAND TOTAL"]
["W2","W2.1","W2",{"$f":"IF(E25=1,H25,IFERROR(VLOOKUP(C25,$B$14:$D$1048576,3,FALSE)&\"FRDSegmentSplit\"&H25,H25))","v":"Normalisation Factor"},{"$f":"IFERROR(LEN(B25)-LEN(SUBSTITUTE(B25,\".\",\"\") ),\"BAD VALUE\")","v":1},null,null,"Normalisation Factor",{"$f":"IF(VLOOKUP(A25,TierIndicators,3,FALSE)=\"Yes\", \"Mandatory\", \"Optional\")","v":"Optional"},{"$f":"M25","v":0},{"$f":"N25","v":"Text"},"Dropdown",null,"Text","NA",null,"Normalisation Factor"]
["W2","W2.2","W2",{"$f":"IF(E26=1,H26,IFERROR(VLOOKUP(C26,$B$14:$D$1048576,3,FALSE)&\"FRDSegmentSplit\"&H26,H26))","v":"Normalisation Factor Value"},{"$f":"IFERROR(LEN(B26)-LEN(SUBSTITUTE(B26,\".\",\"\") ),\"BAD VALUE\")","v":1},null,null,"Normalisation Factor Value",{"$f":"IF(VLOOKUP(A26,TierIndicators,3,FALSE)=\"Yes\", \"Mandatory\", \"Optional\")","v":"Optional"},{"$f":"M26","v":0},{"$f":"N26","v":"Qty"},"Manual",null,"Qty","NA",null,"Normalisation Factor Value"]
["W2","W2.3","W2",{"$f":"IF(E27=1,H27,IFERROR(VLOOKUP(C27,$B$14:$D$1048576,3,FALSE)&\"FRDSegmentSplit\"&H27,H27))","v":"Normalisation Factor Description - provide if selected \"other\" as factor"},{"$f":"IFERROR(LEN(B27)-LEN(SUBSTITUTE(B27,\".\",\"\") ),\"BAD VALUE\")","v":1},null,null,"Normalisation Factor Description - provide if selected \"other\" as factor","Optional",{"$f":"M27","v":0},"Text","Text",null,"Text","NA",null,"Normalisation Factor Description - provide if selected \"other\" as factor"]

{"sheet":"Waste and Recycling","index":14,"n_rows":54,"n_cols":18,"rows_kept":54,"cut":false,"hidden":false,"merged":[[5,1,5,6],[40,2,40,12],[47,2,47,12],[12,2,12,12],[23,2,23,12],[32,2,32,12]]}
[]
[]
[]
[]
[]
[null,{"$f":"Agency&\" | \"&Tier&\" | \"&ReportingPeriod","v":" |  |  - "}]
[]
[null,"<- Back to Home",null,null,null,"Sheet complete:",null,{"$f":"IFERROR(IF(COUNTIF(O:O,\"Pass\")+COUNTIF(O:O,\"FAIL\")=0,\"NA\",IF(VLOOKUP(\"FAIL\",O:O,1,FALSE) = \"FAIL\", IF(COUNTIF(O:O,\"Pass\")=0,\"Not Started\",\"In Progress\"),\"Complete\")),\"Complete\")","v":"NA"}," "]
[null,null,null,null,null,null,null,{"$f":"IF(NOT(OR(H8=\"Complete\",H8=\"NA\")),\"*Mandatory values have not been entered, revisit highlighted items\",\"\")","v":""}]
[null,"Waste and Recycling - Reporting"]
[]
[]
[null,"WR1","Total units of waste disposed of by waste stream and disposal method (kg and %)"]
[null,"ID","Parent ID","FRDSegment","Segment Level",null,null,"Description","Flag","Final Value","Final Unit","Input Type","Input Value","Input Unit","CHECK","Helper"]
["WR1","WR1","NA",{"$f":"IF(E15=1,H15,IFERROR(VLOOKUP(C15,$B$14:$D$1048576,3,FALSE)&\"FRDSegmentSplit\"&H15,H15))","v":"Units of waste disposed by waste stream and disposal method"},{"$f":"IFERROR(LEN(B15)-LEN(SUBSTITUTE(B15,\".\",\"\") ),\"BAD VALUE\")","v":0},null,null,"Units of waste disposed by waste stream and disposal method",{"$f":"IF(VLOOKUP(A15,TierIndicators,3,FALSE)=\"Yes\", \"Mandatory\", \"Optional\")","v":"Optional"},{"$f":"IF(N15=\"NA\", _xlfn.VALUETOTEXT(M15), M15*OFFSET(Admin!$AR$3,MATCH(N15,convSources,0),MATCH(K15,convTargets,0)))","v":0},"KG","Segment Aggregation",{"$f":"SUMIF(C:C,B15,J:J)","v":0},"KG",{"$f":"IF(OR(L15=\"Segment Aggregation\",L15=\"Auto-Calc\"),\"NA\",IF(AND(I15=\"Mandatory\",OR(M15=\"\",N15=\"\")), \"FAIL\", IF(I15=\"Optional\",\"NA\",\"PASS\")))","v":"NA"},{"$f":"IF(E15<=1,H15,VLOOKUP(C15,$B$15:$P$20,15,0))","v":"Units of waste disposed by waste stream and disposal method"}]
["WR1","WR1.1","WR1","Landfill (disposal)",1,"+ (add segment)",null,"Landfill (disposal)","Optional",{"$f":"IF(N16=\"NA\", _xlfn.VALUETOTEXT(M16), M16*OFFSET(Admin!$AR$3,MATCH(N16,convSources,0),MATCH(K16,convTargets,0)))","v":0},"KG","Segment Aggregation",{"$f":"SUMIF(C:C,B16,J:J)","v":0},"KG","NA","Landfill (disposal)",null,{"$f":"IF(VLOOKUP(A16,Calculations,MATCH(\"data imported?\",Admin!$Q$2:$V$2,0),0),IF(WasteProgress<>\"Complete\",\"map imported data - see user guide\",\"calculation available\"),\"import data from home tab to use calculations\")","v":"import data from home tab to use calculations"}]
["WR1","WR1.1.1","WR1.1","Landfill (disposal)FRDSegmentSplitLandfill",2,"+ (add segment)",null,"Landfill","Optional",{"$f":"IF(N17=\"NA\", _xlfn.VALUETOTEXT(M17), M17*OFFSET(Admin!$AR$3,MATCH(N17,convSources,0),MATCH(K17,convTargets,0)))","v":0},"KG","Manual",null,"KG","NA","Landfill (disposal)",null,{"$f":"IF(VLOOKUP(A17,Calculations,MATCH(\"data imported?\",Admin!$Q$2:$V$2,0),0),IF(WasteProgress<>\"Complete\",\"map imported data - see user guide\",\"calculation available\"),\"import data from home tab to use calculations\")","v":"import data from home tab to use calculations"}]
["WR1","WR1.2","WR1","Recycling/recovery (disposal)",{"$f":"IFERROR(LEN(B18)-LEN(SUBSTITUTE(B18,\".\",\"\") ),\"BAD VALUE\")","v":1},"+ (add segment)",null,"Recycling/recovery (disposal)",{"$f":"IF(VLOOKUP(A18,TierIndicators,3,FALSE)=\"Yes\", \"Mandatory\", \"Optional\")","v":"Optional"},{"$f":"IF(N18=\"NA\", _xlfn.VALUETOTEXT(M18), M18*OFFSET(Admin!$AR$3,MATCH(N18,convSources,0),MATCH(K18,convTargets,0)))","v":0},"KG","Segment Aggregation",{"$f":"SUMIF(C:C,B18,J:J)","v":0},"KG","NA","Recycling/recovery (disposal)",null,{"$f":"IF(VLOOKUP(A18,Calculations,MATCH(\"data imported?\",Admin!$Q$2:$V$2,0),0),IF(WasteProgress<>\"Complete\",\"map imported data - see user guide\",\"calculation available\"),\"import data from home tab to use calculations\")","v":"import data from home tab to use calculations"}]
["WR1",{"$f":"C19 & \".\" & COUNTIF($C$1:OFFSET(C19,-1,0),C19) +1","v":"WR1.2.1"},"WR1.2","Recycling/recovery (disposal)FRDSegmentSplit",{"$f":"IFERROR(LEN(B19)-LEN(SUBSTITUTE(B19,\".\",\"\") ),\"BAD VALUE\")","v":2},"+ (add segment)",null,null,{"$f":"IF(VLOOKUP(A19,TierIndicators,3,FALSE)=\"Yes\", \"Mandatory\", \"Optional\")","v":"Optional"},{"$f":"IF(N19=\"NA\", _xlfn.VALUETOTEXT(M19), M19*OFFSET(Admin!$AR$3,MATCH(N19,convSources,0),MATCH(K19,convTargets,0)))","v":0},"KG","Manual",null,"KG","NA","Recycling/recovery (disposal)",null,{"$f":"IF(VLOOKUP(A19,Calculations,MATCH(\"data imported?\",Admin!$Q$2:$V$2,0),0),IF(WasteProgress<>\"Complete\",\"map imported data - see user guide\",\"calculation available\"),\"import data from home tab to use calculations\")","v":"import data from home tab to use calculations"}]
["WR1","WR1.3","WR1","Other",1,"+ (add segment)",null,"Other","Optional",{"$f":"IF(N20=\"NA\", _xlfn.VALUETOTEXT(M20), M20*OFFSET(Admin!$AR$3,MATCH(N20,convSources,0),MATCH(K20,convTargets,0)))","v":0},"KG","Segment Aggregation",{"$f":"SUMIF(C:C,B20,J:J)","v":0},"KG","NA","Other",null,{"$f":"IF(VLOOKUP(A20,Calculations,MATCH(\"data imported?\",Admin!$Q$2:$V$2,0),0),IF(WasteProgress<>\"Complete\",\"map imported data - see user guide\",\"calculation available\"),\"import data from home tab to use calculations\")","v":"import data from home tab to use calculations"}]
["WR1",{"$f":"C21 & \".\" & COUNTIF($C$1:OFFSET(C21,-1,0),C21) +1","v":"WR1.3.1"},"WR1.3","OtherFRDSegmentSplit",{"$f":"IFERROR(LEN(B21)-LEN(SUBSTITUTE(B21,\".\",\"\") ),\"BAD VALUE\")","v":2},"+ (add segment)",null,null,{"$f":"IF(VLOOKUP(A21,TierIndicators,3,FALSE)=\"Yes\", \"Mandatory\", \"Optional\")","v":"Optional"},{"$f":"IF(N21=\"NA\", _xlfn.VALUETOTEXT(M21), M21*OFFSET(Admin!$AR$3,MATCH(N21,convSources,0),MATCH(K21,convTargets,0)))","v":0},"KG","Manual",null,"KG","NA","Other",null,{"$f":"IF(VLOOKUP(A21,Calculations,MATCH(\"data imported?\",Admin!$Q$2:$V$2,0),0),IF(WasteProgress<>\"Complete\",\"map imported data - see user guide\",\"calculation available\"),\"import data from home tab to use calculations\")","v":"import data from home tab to use calculations"}]
[]
[]
[null,"WR2","Percentage of office sites covered by dedicated collection services for each waste stream"]
[null,"ID","Parent ID","FRDSegment","Segment Level",null,null,"Description","Flag","Final Value","Final Unit","Input Type","Input Value","Input Unit","CHECK"]
["WR2","WR2","NA",{"$f":"IF(E26=1,H26,IFERROR(VLOOKUP(C26,$B$14:$D$1048576,3,FALSE)&\"FRDSegmentSplit\"&H26,H26))","v":"GRAND TOTAL"},{"$f":"IFERROR(LEN(B26)-LEN(SUBSTITUTE(B26,\".\",\"\") ),\"BAD VALUE\")","v":0},"+ (add segment)",null,"GRAND TOTAL",{"$f":"IF(VLOOKUP(A26,TierIndicators,3,FALSE)=\"Yes\", \"Mandatory\", \"Optional\")","v":"Optional"},{"$f":"M26","v":"No aggregation"},"NA",null,"No aggregation","NA",{"$f":"IF(OR(L26=\"Segment Aggregation\",L26=\"Auto-Calc\"),\"NA\",IF(AND(I26=\"Mandatory\",OR(M26=\"\",N26=\"\")), \"FAIL\", IF(I26=\"Optional\",\"NA\",\"PASS\")))","v":"NA"},null,"Printer cartridges"]
["WR2","WR2.1","WR2",{"$f":"IF(E27=1,H27,IFERROR(VLOOKUP(C27,$B$14:$D$1048576,3,FALSE)&\"FRDSegmentSplit\"&H27,H27))","v":"Printer cartridges"},{"$f":"IFERROR(LEN(B27)-LEN(SUBSTITUTE(B27,\".\",\"\") ),\"BAD VALUE\")","v":1},null,null,"Printer cartridges",{"$f":"IF(VLOOKUP(A27,TierIndicators,3,FALSE)=\"Yes\", \"Mandatory\", \"Optional\")","v":"Optional"},{"$f":"M27","v":0},"%","Manual",null,"%","NA"]
["WR2","WR2.2","WR2",{"$f":"IF(E28=1,H28,IFERROR(VLOOKUP(C28,$B$14:$D$1048576,3,FALSE)&\"FRDSegmentSplit\"&H28,H28))","v":"Batteries"},{"$f":"IFERROR(LEN(B28)-LEN(SUBSTITUTE(B28,\".\",\"\") ),\"BAD VALUE\")","v":1},null,null,"Batteries",{"$f":"IF(VLOOKUP(A28,TierIndicators,3,FALSE)=\"Yes\", \"Mandatory\", \"Optional\")","v":"Optional"},{"$f":"M28","v":0},"%","Manual",null,"%","NA",null,"Batteries"]
["WR2","WR2.3","WR2",{"$f":"IF(E29=1,H29,IFERROR(VLOOKUP(C29,$B$14:$D$1048576,3,FALSE)&\"FRDSegmentSplit\"&H29,H29))","v":"e-waste"},{"$f":"IFERROR(LEN(B29)-LEN(SUBSTITUTE(B29,\".\",\"\") ),\"BAD VALUE\")","v":1},null,null,"e-waste",{"$f":"IF(VLOOKUP(A29,TierIndicators,3,FALSE)=\"Yes\", \"Mandatory\", \"Optional\")","v":"Optional"},{"$f":"M29","v":0},"%","Manual",null,"%","NA",null,"e-waste"]
["WR2","WR2.4","WR2",{"$f":"IF(E30=1,H30,IFERROR(VLOOKUP(C30,$B$14:$D$1048576,3,FALSE)&\"FRDSegmentSplit\"&H30,H30))","v":"Soft plastics"},{"$f":"IFERROR(LEN(B30)-LEN(SUBSTITUTE(B30,\".\",\"\") ),\"BAD VALUE\")","v":1},null,null,"Soft plastics",{"$f":"IF(VLOOKUP(A30,TierIndicators,3,FALSE)=\"Yes\", \"Mandatory\", \"Optional\")","v":"Optional"},0,"%","Manual",null,"%","NA",null,"Soft plastics"]
[]
[]
[null,"WR3","Total units of waste disposed normalised by FTE, headcount, floor area, or other entity or sector specific quantity, by disposal method"]
[null,"ID","Parent ID","FRDSegment","Segment Level",null,null,"Description","Flag","Final Value","Final Unit","Input Type","Input Value","Input Unit","CHECK"]
["WR3","WR3","NA",{"$f":"IF(E35=1,H35,IFERROR(VLOOKUP(C35,$B$14:$D$1048576,3,FALSE)&\"FRDSegmentSplit\"&H35,H35))","v":"GRAND TOTAL"},{"$f":"IFERROR(LEN(B35)-LEN(SUBSTITUTE(B35,\".\",\"\") ),\"BAD VALUE\")","v":0},null,null,"GRAND TOTAL",{"$f":"IF(VLOOKUP(A35,TierIndicators,3,FALSE)=\"Yes\", \"Mandatory\", \"Optional\")","v":"Optional"},{"$f":"M35","v":0},"KG","Auto-Calc",{"$f":"IFERROR(J15/J37,0)","v":0},{"$f":"K15","v":"KG"},{"$f":"IF(OR(L35=\"Segment Aggregation\",L35=\"Auto-Calc\"),\"NA\",IF(AND(I35=\"Mandatory\",OR(M35=\"\",N35=\"\")), \"FAIL\", IF(I35=\"Optional\",\"NA\",\"PASS\")))","v":"NA"},null,"GRAND TOTAL"]
["WR3","WR3.1","WR3",{"$f":"IF(E36=1,H36,IFERROR(VLOOKUP(C36,$B$14:$D$1048576,3,FALSE)&\"FRDSegmentSplit\"&H36,H36))","v":"Normalisation Factor"},{"$f":"IFERROR(LEN(B36)-LEN(SUBSTITUTE(B36,\".\",\"\") ),\"BAD VALUE\")","v":1},null,null,"Normalisation Factor",{"$f":"IF(VLOOKUP(A36,TierIndicators,3,FALSE)=\"Yes\", \"Mandatory\", \"Optional\")","v":"Optional"},{"$f":"M36","v":0},"Text","Dropdown",null,"Text","NA",null,"Normalisation Factor"]
["WR3","WR3.2","WR3",{"$f":"IF(E37=1,H37,IFERROR(VLOOKUP(C37,$B$14:$D$1048576,3,FALSE)&\"FRDSegmentSplit\"&H37,H37))","v":"Normalisation Factor Value"},{"$f":"IFERROR(LEN(B37)-LEN(SUBSTITUTE(B37,\".\",\"\") ),\"BAD VALUE\")","v":1},null,null,"Normalisation Factor Value",{"$f":"IF(VLOOKUP(A37,TierIndicators,3,FALSE)=\"Yes\", \"Mandatory\", \"Optional\")","v":"Optional"},{"$f":"M37","v":0},"Qty","Manual",null,"Qty","NA",null,"Normalisation Factor Value"]
["WR3","WR3.3","WR3",{"$f":"IF(E38=1,H38,IFERROR(VLOOKUP(C38,$B$14:$D$1048576,3,FALSE)&\"FRDSegmentSplit\"&H38,H38))","v":"Normalisation Factor Description - provide if selected \"other\" as factor"},{"$f":"IFERROR(LEN(B38)-LEN(SUBSTITUTE(B38,\".\",\"\") ),\"BAD VALUE\")","v":1},null,null,"Normalisation Factor Description - provide if selected \"other\" as factor","Optional",0,"Text","Text",null,"Text","NA",null,"Normalisation Factor Value"]
[]
[]
[null,"WR4","Recycling rate (% of total waste by weight)"]
[null,"ID","Parent ID","FRDSegment","Segment Level",null,null,"Description","Flag","Final Value","Final Unit","Input Type","Input Value","Input Unit","CHECK"]
["WR4","WR4","NA",{"$f":"IF(E43=1,H43,IFERROR(VLOOKUP(C43,$B$14:$D$1048576,3,FALSE)&\"FRDSegmentSplit\"&H43,H43))","v":"Recycling Rate"},{"$f":"IFERROR(LEN(B43)-LEN(SUBSTITUTE(B43,\".\",\"\") ),\"BAD VALUE\")","v":0},null,null,"Recycling Rate",{"$f":"IF(VLOOKUP(A43,TierIndicators,3,FALSE)=\"Yes\", \"Mandatory\", \"Optional\")","v":"Optional"},{"$f":"M43","v":0},"%","Auto-Calc",{"$f":"IFERROR(J44/J45,0)","v":0},"%",{"$f":"IF(OR(L43=\"Segment Aggregation\",L43=\"Auto-Calc\"),\"NA\",IF(AND(I43=\"Mandatory\",OR(M43=\"\",N43=\"\")), \"FAIL\", IF(I43=\"Optional\",\"NA\",\"PASS\")))","v":"NA"},null,"Recycling Rate"]
["WR4","WR4.1","WR4",{"$f":"IF(E44=1,H44,IFERROR(VLOOKUP(C44,$B$14:$D$1048576,3,FALSE)&\"FRDSegmentSplit\"&H44,H44))","v":"Weight of recyclable and organic materials"},{"$f":"IFERROR(LEN(B44)-LEN(SUBSTITUTE(B44,\".\",\"\") ),\"BAD VALUE\")","v":1},null,null,"Weight of recyclable and organic materials",{"$f":"IF(VLOOKUP(A44,TierIndicators,3,FALSE)=\"Yes\", \"Mandatory\", \"Optional\")","v":"Optional"},{"$f":"IF(N44=\"NA\", _xlfn.VALUETOTEXT(M44), M44*OFFSET(Admin!$AR$3,MATCH(N44,convSources,0),MATCH(K44,convTargets,0)))","v":0},"KG","Auto-Calc",{"$f":"J18","v":0},"KG","NA",null,"Weight of recyclable and organic materials"]
["WR4","WR4.2","WR4",{"$f":"IF(E45=1,H45,IFERROR(VLOOKUP(C45,$B$14:$D$1048576,3,FALSE)&\"FRDSegmentSplit\"&H45,H45))","v":"Weight of total waste"},{"$f":"IFERROR(LEN(B45)-LEN(SUBSTITUTE(B45,\".\",\"\") ),\"BAD VALUE\")","v":1},null,null,"Weight of total waste",{"$f":"IF(VLOOKUP(A45,TierIndicators,3,FALSE)=\"Yes\", \"Mandatory\", \"Optional\")","v":"Optional"},{"$f":"IF(N45=\"NA\", _xlfn.VALUETOTEXT(M45), M45*OFFSET(Admin!$AR$3,MATCH(N45,convSources,0),MATCH(K45,convTargets,0)))","v":0},"KG","Auto-Calc",{"$f":"J15","v":0},"KG","NA",null,"Weight of total waste"]
[]
[]
[null,"WR5","Greenhouse gas emissions associated with waste disposal (tonnes CO2-e)"]
[null,"ID","Parent ID","FRDSegment","Segment Level",null,null,"Description","Flag","Final Value","Final Unit","Input Type","Input Value","Input Unit","CHECK"]
["WR5","WR5","NA",{"$f":"IF(E50=1,H50,IFERROR(VLOOKUP(C50,$B$14:$D$1048576,3,FALSE)&\"FRDSegmentSplit\"&H50,H50))","v":"Grand total"},{"$f":"IFERROR(LEN(B50)-LEN(SUBSTITUTE(B50,\".\",\"\") ),\"BAD VALUE\")","v":0},null,null,"Grand total",{"$f":"IF(VLOOKUP(A50,TierIndicators,3,FALSE)=\"Yes\", \"Mandatory\", \"Optional\")","v":"Optional"},{"$f":"IF(N50=\"NA\", _xlfn.VALUETOTEXT(M50), M50*OFFSET(Admin!$AR$3,MATCH(N50,convSources,0),MATCH(K50,convTargets,0)))","v":0},"Tonnes CO2-e","Segment Aggregation",{"$f":"SUMIF(C:C,B50,J:J)","v":0},"Tonnes CO2-e",{"$f":"IF(OR(L50=\"Segment Aggregation\",L50=\"Auto-Calc\"),\"NA\",IF(AND(I50=\"Mandatory\",OR(M50=\"\",N50=\"\")), \"FAIL\", IF(I50=\"Optional\",\"NA\",\"PASS\")))","v":"NA"},null,"Grand total"]
["WR5","WR5.1","WR5",{"$f":"IF(E51=1,H51,IFERROR(VLOOKUP(C51,$B$14:$D$1048576,3,FALSE)&\"FRDSegmentSplit\"&H51,H51))","v":"Landfill (disposal)"},{"$f":"IFERROR(LEN(B51)-LEN(SUBSTITUTE(B51,\".\",\"\") ),\"BAD VALUE\")","v":1},"+ (add segment)",null,"Landfill (disposal)",{"$f":"IF(VLOOKUP(A51,TierIndicators,3,FALSE)=\"Yes\", \"Mandatory\", \"Optional\")","v":"Optional"},{"$f":"IF(N51=\"NA\", _xlfn.VALUETOTEXT(M51), M51*OFFSET(Admin!$AR$3,MATCH(N51,convSources,0),MATCH(K51,convTargets,0)))","v":0},"Tonnes CO2-e","Segment Aggregation",{"$f":"SUMIF(C:C,B51,J:J)","v":0},"Tonnes CO2-e","NA",null,"Landfill (disposal)"]
["WR5",{"$f":"C52 & \".\" & COUNTIF($C$1:OFFSET(C52,-1,0),C52) +1","v":"WR5.1.1"},"WR5.1",{"$f":"IF(E52=1,H52,IFERROR(VLOOKUP(C52,$B$14:$D$1048576,3,FALSE)&\"FRDSegmentSplit\"&H52,H52))","v":"Landfill (disposal)FRDSegmentSplitLandfill"},{"$f":"IFERROR(LEN(B52)-LEN(SUBSTITUTE(B52,\".\",\"\") ),\"BAD VALUE\")","v":2},null,null,"Landfill",{"$f":"IF(VLOOKUP(A52,TierIndicators,3,FALSE)=\"Yes\", \"Mandatory\", \"Optional\")","v":"Optional"},{"$f":"IF(N52=\"NA\", _xlfn.VALUETOTEXT(M52), M52*OFFSET(Admin!$AR$3,MATCH(N52,convSources,0),MATCH(K52,convTargets,0)))","v":0},"Tonnes CO2-e","Auto-Calc",{"$f":"J17 * OFFSET(Admin!$AR$3,MATCH(K17,convSources,0),MATCH(\"Tonnes\",convTargets,0))  *  IFERROR(VLOOKUP(A52 & \"-\" & Q52,Admin!BN:BQ,4,FALSE),0)","v":0},"Tonnes CO2-e","NA",null,"Landfill"]
["WR5","WR5.2","WR5",{"$f":"IF(E53=1,H53,IFERROR(VLOOKUP(C53,$B$14:$D$1048576,3,FALSE)&\"FRDSegmentSplit\"&H53,H53))","v":"Recycling/recovery (disposal)"},1,null,null,"Recycling/recovery (disposal)","Optional",{"$f":"IF(N53=\"NA\", _xlfn.VALUETOTEXT(M53), M53*OFFSET(Admin!$AR$3,MATCH(N53,convSources,0),MATCH(K53,convTargets,0)))","v":0},"Tonnes CO2-e","Auto-Calc",0,"Tonnes CO2-e","NA",null,"Recycling/recovery (disposal)"]
["WR5","WR5.3","WR5",{"$f":"IF(E54=1,H54,IFERROR(VLOOKUP(C54,$B$14:$D$1048576,3,FALSE)&\"FRDSegmentSplit\"&H54,H54))","v":"Other"},1,"+ (add segment)",null,"Other","Optional",{"$f":"IF(N54=\"NA\", _xlfn.VALUETOTEXT(M54), M54*OFFSET(Admin!$AR$3,MATCH(N54,convSources,0),MATCH(K54,convTargets,0)))","v":0},"Tonnes CO2-e","Manual",null,"Tonnes CO2-e","NA",null,"Any other large sector specific waste stream (disposal)"]

{"sheet":"Greenhouse Gas Emissions","index":15,"n_rows":75,"n_cols":18,"rows_kept":75,"cut":false,"hidden":false,"merged":[[62,2,62,12],[68,2,68,12],[43,2,43,12],[5,1,5,6],[37,2,37,12],[12,2,12,12],[50,2,50,12],[56,2,56,12]]}
[]
[]
[]
[]
[]
[null,{"$f":"Agency&\" | \"&Tier&\" | \"&ReportingPeriod","v":" |  |  - "}]
[]
[null,"<- Back to Home",null,null,null,"Sheet complete:",null,{"$f":"IFERROR(IF(COUNTIF(O:O,\"Pass\")+COUNTIF(O:O,\"FAIL\")=0,\"NA\",IF(VLOOKUP(\"FAIL\",O:O,1,FALSE) = \"FAIL\", IF(COUNTIF(O:O,\"Pass\")=0,\"Not Started\",\"In Progress\"),\"Complete\")),\"Complete\")","v":"NA"}," "]
[null,null,null,null,null,null,null,{"$f":"IF(NOT(OR(H8=\"Complete\",H8=\"NA\")),\"*Mandatory values have not been entered, revisit highlighted items\",\"\")","v":""}]
[null,"Greenhouse Gas Emissions - Reporting"]
[]
[]
[null,"G1","Total scope one (direct) greenhouse gas emissions (tonnes CO2e)"]
[null,"ID","Parent ID","FRDSegment","Segment Level",null,null,"Description","Flag","Final Value","Final Unit","Input Type","Input Value","Input Unit","CHECK","Gas classification"]
["G1","#G1 - CO2","NA",{"$f":"IF(E15=1,H15,IFERROR(VLOOKUP(C15,$B$14:$D$1048576,3,FALSE)&\"FRDSegmentSplit\"&H15,H15))","v":"TOTAL - Carbon dioxide (CO2)"},{"$f":"IFERROR(LEN(B15)-LEN(SUBSTITUTE(B15,\".\",\"\") ),\"BAD VALUE\")","v":0},null,null,"TOTAL - Carbon dioxide (CO2)",{"$f":"IF(VLOOKUP(A15,TierIndicators,3,FALSE)=\"Yes\", \"Mandatory\", \"Optional\")","v":"Optional"},{"$f":"IF(N15=\"NA\",M15,IF(N15=K15,M15,M15*IF(RIGHT(N15,5)=\"CO2-e\",OFFSET(Admin!$AR$3,MATCH(N15,convSources,0),MATCH(K15,convTargets,0)),VLOOKUP(A15&\"-\"&Q15,Admin!BN:BQ,4,FALSE)*OFFSET(Admin!$AR$3,MATCH(N15,convSources,0),MATCH(\"KG\",convTargets,0)))))","v":0},"Tonnes CO2-e","Auto-calc",{"$f":"SUM('Stationary Fuel Use'!R51, Transportation!S181)+SUMIF(H:H,\"CO2*\",J:J)","v":0},"Tonnes CO2-e",{"$f":"IF(OR(L15=\"Segment Aggregation\",L15=\"Auto-Calc\"),\"NA\",IF(AND(I15=\"Mandatory\",OR(M15=\"\",N15=\"\")), \"FAIL\", IF(I15=\"Optional\",\"NA\",\"PASS\")))","v":"NA"},null,"GRAND TOTAL - Tonnes CO2"]
["G1","#G1 - CH4","NA","TOTAL - Methane (CH4)",0,null,null,"TOTAL - Methane (CH4)",{"$f":"IF(VLOOKUP(A16,TierIndicators,3,FALSE)=\"Yes\", \"Mandatory\", \"Optional\")","v":"Optional"},{"$f":"IF(N16=\"NA\",M16,IF(N16=K16,M16,M16*IF(RIGHT(N16,5)=\"CO2-e\",OFFSET(Admin!$AR$3,MATCH(N16,convSources,0),MATCH(K16,convTargets,0)),VLOOKUP(A16&\"-\"&Q16,Admin!BN:BQ,4,FALSE)*OFFSET(Admin!$AR$3,MATCH(N16,convSources,0),MATCH(\"KG\",convTargets,0)))))","v":0},"Tonnes CO2-e","Auto-calc",{"$f":"SUM('Stationary Fuel Use'!S51,Transportation!T181)+J28+SUMIF(H:H,\"CH4*\",J:J)","v":0},"Tonnes CO2-e","NA",null,"GRAND TOTAL - Tonnes CH4"]
["G1","#G1 - N2O","NA","TOTAL - Nitrous oxide (N2O)",0,null,null,"TOTAL - Nitrous oxide (N2O)","Optional",{"$f":"IF(N17=\"NA\",M17,IF(N17=K17,M17,M17*IF(RIGHT(N17,5)=\"CO2-e\",OFFSET(Admin!$AR$3,MATCH(N17,convSources,0),MATCH(K17,convTargets,0)),VLOOKUP(A17&\"-\"&Q17,Admin!BN:BQ,4,FALSE)*OFFSET(Admin!$AR$3,MATCH(N17,convSources,0),MATCH(\"KG\",convTargets,0)))))","v":0},"Tonnes CO2-e","Auto-calc",{"$f":"SUM('Stationary Fuel Use'!T51, Transportation!U181)+J26+SUMIF(H:H,\"N2O*\",J:J)","v":0},"Tonnes CO2-e","NA",null,"GRAND TOTAL - Tonnes N2O"]
["G1","#G1 - other","NA","TOTAL - Other",{"$f":"IFERROR(LEN(B18)-LEN(SUBSTITUTE(B18,\".\",\"\") ),\"BAD VALUE\")","v":0},null,null,"TOTAL - Other",{"$f":"IF(VLOOKUP(A18,TierIndicators,3,FALSE)=\"Yes\", \"Mandatory\", \"Optional\")","v":"Optional"},{"$f":"IF(N18=\"NA\",M18,IF(N18=K18,M18,M18*IF(RIGHT(N18,5)=\"CO2-e\",OFFSET(Admin!$AR$3,MATCH(N18,convSources,0),MATCH(K18,convTargets,0)),VLOOKUP(A18&\"-\"&Q18,Admin!BN:BQ,4,FALSE)*OFFSET(Admin!$AR$3,MATCH(N18,convSources,0),MATCH(\"KG\",convTargets,0)))))","v":0},"Tonnes CO2-e","Auto-calc",{"$f":"'Stationary Fuel Use'!J56+SUM(Transportation!J193:J194)+SUM(Transportation!J214:J215)+Transportation!J217+SUM(J23:J25)+J35+SUMIF(H:H,\"\",J:J)+SUMIF(H:H,\"PFC*\",J:J)+SUMIF(H:H,\"HFC*\",J:J)+SUMIF(H:H,\"SF6*\",J:J)+SUMIF(H:H,\"NF3*\",J:J)+SUMIFS(J:J,H:H,\"Refrigeration (Commercial)\",L:L,\"<>Segment Aggregation\")+SUMIFS(J:J,H:H,\"Air conditioning\",L:L,\"<>Segment Aggregation\")+SUMIFS(J:J,H:H,\"Electrical equipment\",L:L,\"<>Segment Aggregation\")+SUMIFS(J:J,H:H,\"Fire suppression equipment*\",L:L,\"<>Segment Aggregation\")+SUMIFS(J:J,H:H,\"Other uses or releases of greenhouse gases*\",L:L,\"<>Segment Aggregation\")","v":0},"Tonnes CO2-e",{"$f":"IF(OR(L18=\"Segment Aggregation\",L18=\"Auto-Calc\"),\"NA\",IF(AND(I18=\"Mandatory\",OR(M18=\"\",N18=\"\")), \"FAIL\", IF(I18=\"Optional\",\"NA\",\"PASS\")))","v":"NA"},null,"GRAND TOTAL - Tonnes N2O"]
["G1","G1","NA","GRAND TOTAL - Tonnes CO2-e",{"$f":"IFERROR(LEN(B19)-LEN(SUBSTITUTE(B19,\".\",\"\") ),\"BAD VALUE\")","v":0},null,null,"GRAND TOTAL - Tonnes CO2-e",{"$f":"IF(VLOOKUP(A19,TierIndicators,3,FALSE)=\"Yes\", \"Mandatory\", \"Optional\")","v":"Optional"},{"$f":"IF(N19=\"NA\",M19,IF(N19=K19,M19,M19*IF(RIGHT(N19,5)=\"CO2-e\",OFFSET(Admin!$AR$3,MATCH(N19,convSources,0),MATCH(K19,convTargets,0)),VLOOKUP(A19&\"-\"&Q19,Admin!BN:BQ,4,FALSE)*OFFSET(Admin!$AR$3,MATCH(N19,convSources,0),MATCH(\"KG\",convTargets,0)))))","v":0},"Tonnes CO2-e","Segment Aggregation",{"$f":"SUMIF(C:C,B19,J:J)","v":0},"Tonnes CO2-e",{"$f":"IF(OR(L19=\"Segment Aggregation\",L19=\"Auto-Calc\"),\"NA\",IF(AND(I19=\"Mandatory\",OR(M19=\"\",N19=\"\")), \"FAIL\", IF(I19=\"Optional\",\"NA\",\"PASS\")))","v":"NA"},null,"GRAND TOTAL - Tonnes CO2-e"]
["G1","G1.1","G1","F2 GHG emissions from stationary fuel",1,null,null,"F2 GHG emissions from stationary fuel","Optional",{"$f":"IF(N20=\"NA\",M20,IF(N20=K20,M20,M20*IF(RIGHT(N20,5)=\"CO2-e\",OFFSET(Admin!$AR$3,MATCH(N20,convSources,0),MATCH(K20,convTargets,0)),VLOOKUP(A20&\"-\"&Q20,Admin!BN:BQ,4,FALSE)*OFFSET(Admin!$AR$3,MATCH(N20,convSources,0),MATCH(\"KG\",convTargets,0)))))","v":0},"Tonnes CO2-e","Auto-calc",{"$f":"'Stationary Fuel Use'!J51","v":0},"Tonnes CO2-e","NA",null,"F2 GHG emissions from stationary fuel"]
["G1","G1.2","G1","T3 GHG emissions from vehicle fleet",1,null,null,"T3 GHG emissions from vehicle fleet","Optional",{"$f":"IF(N21=\"NA\",M21,IF(N21=K21,M21,M21*IF(RIGHT(N21,5)=\"CO2-e\",OFFSET(Admin!$AR$3,MATCH(N21,convSources,0),MATCH(K21,convTargets,0)),VLOOKUP(A21&\"-\"&Q21,Admin!BN:BQ,4,FALSE)*OFFSET(Admin!$AR$3,MATCH(N21,convSources,0),MATCH(\"KG\",convTargets,0)))))","v":0},"Tonnes CO2-e","Auto-calc",{"$f":"Transportation!J181-Transportation!J220+Transportation!J217","v":0},"Tonnes CO2-e","NA",null,"T3 GHG emissions from vehicle fleet owned by the entity (if leased - scope3)"]
["G1","G1.3","G1","Medical gases",1,null,null,"Medical gases","Optional",{"$f":"IF(N22=\"NA\",M22,IF(N22=K22,M22,M22*IF(RIGHT(N22,5)=\"CO2-e\",OFFSET(Admin!$AR$3,MATCH(N22,convSources,0),MATCH(K22,convTargets,0)),VLOOKUP(A22&\"-\"&Q22,Admin!BN:BQ,4,FALSE)*OFFSET(Admin!$AR$3,MATCH(N22,convSources,0),MATCH(\"KG\",convTargets,0)))))","v":0},"Tonnes CO2-e","Segment Aggregation",{"$f":"SUMIF(C:C,B22,J:J)","v":0},"Tonnes CO2-e","NA",null,"Medical gases"]
["G1","G1.3.1","G1.3","Medical gasesFRDSegmentSplitDesflurane",2,null,null,"Desflurane","Optional",{"$f":"IF(N23=\"NA\",M23,IF(N23=K23,M23,M23*IF(RIGHT(N23,5)=\"CO2-e\",OFFSET(Admin!$AR$3,MATCH(N23,convSources,0),MATCH(K23,convTargets,0)),VLOOKUP(A23&\"-\"&Q23,Admin!BN:BQ,4,FALSE)*OFFSET(Admin!$AR$3,MATCH(N23,convSources,0),MATCH(\"KG\",convTargets,0)))))","v":0},"Tonnes CO2-e","Manual",null,"Tonnes CO2-e","NA",null,"Desflurane"]
["G1","G1.3.2","G1.3","Medical gasesFRDSegmentSplitIsoflurane",2,null,null,"Isoflurane","Optional",{"$f":"IF(N24=\"NA\",M24,IF(N24=K24,M24,M24*IF(RIGHT(N24,5)=\"CO2-e\",OFFSET(Admin!$AR$3,MATCH(N24,convSources,0),MATCH(K24,convTargets,0)),VLOOKUP(A24&\"-\"&Q24,Admin!BN:BQ,4,FALSE)*OFFSET(Admin!$AR$3,MATCH(N24,convSources,0),MATCH(\"KG\",convTargets,0)))))","v":0},"Tonnes CO2-e","Manual",null,"Tonnes CO2-e","NA",null,"Isoflurane"]
["G1","G1.3.3","G1.3","Medical gasesFRDSegmentSplitSevoflurane",2,null,null,"Sevoflurane","Optional",{"$f":"IF(N25=\"NA\",M25,IF(N25=K25,M25,M25*IF(RIGHT(N25,5)=\"CO2-e\",OFFSET(Admin!$AR$3,MATCH(N25,convSources,0),MATCH(K25,convTargets,0)),VLOOKUP(A25&\"-\"&Q25,Admin!BN:BQ,4,FALSE)*OFFSET(Admin!$AR$3,MATCH(N25,convSources,0),MATCH(\"KG\",convTargets,0)))))","v":0},"Tonnes CO2-e","Manual",null,"Tonnes CO2-e","NA",null,"Sevoflurane"]
["G1","G1.3.4","G1.3","Medical gasesFRDSegmentSplitNitrous oxide",2,null,null,"Nitrous oxide","Optional",{"$f":"IF(N26=\"NA\",M26,IF(N26=K26,M26,M26*IF(RIGHT(N26,5)=\"CO2-e\",OFFSET(Admin!$AR$3,MATCH(N26,convSources,0),MATCH(K26,convTargets,0)),VLOOKUP(A26&\"-\"&Q26,Admin!BN:BQ,4,FALSE)*OFFSET(Admin!$AR$3,MATCH(N26,convSources,0),MATCH(\"KG\",convTargets,0)))))","v":0},"Tonnes CO2-e","Manual",null,"Tonnes CO2-e","NA",null,"Nitrous oxide"]
["G1","G1.4","G1","Fugitive Emissions",1,null,null,"Fugitive Emissions","Optional",{"$f":"IF(N27=\"NA\",M27,IF(N27=K27,M27,M27*IF(RIGHT(N27,5)=\"CO2-e\",OFFSET(Admin!$AR$3,MATCH(N27,convSources,0),MATCH(K27,convTargets,0)),VLOOKUP(A27&\"-\"&Q27,Admin!BN:BQ,4,FALSE)*OFFSET(Admin!$AR$3,MATCH(N27,convSources,0),MATCH(\"KG\",convTargets,0)))))","v":0},"Tonnes CO2-e","Segment Aggregation",{"$f":"SUMIF(C:C,B27,J:J)","v":0},"Tonnes CO2-e","NA",null,"Fugitive Emissions"]
["G1","G1.4.1","G1.4","Fugitive EmissionsFRDSegmentSplitWastewater treatment (CH4)",2,null,null,"Wastewater treatment (CH4)","Optional",{"$f":"IF(N28=\"NA\",M28,IF(N28=K28,M28,M28*IF(RIGHT(N28,5)=\"CO2-e\",OFFSET(Admin!$AR$3,MATCH(N28,convSources,0),MATCH(K28,convTargets,0)),VLOOKUP(A28&\"-\"&Q28,Admin!BN:BQ,4,FALSE)*OFFSET(Admin!$AR$3,MATCH(N28,convSources,0),MATCH(\"KG\",convTargets,0)))))","v":0},"Tonnes CO2-e","Manual",null,"Tonnes CO2-e","NA",null,"Wastewater treatment"]
["G1","G1.4.2","G1.4","Fugitive EmissionsFRDSegmentSplitRefrigeration (Commercial)",{"$f":"IFERROR(LEN(B29)-LEN(SUBSTITUTE(B29,\".\",\"\") ),\"BAD VALUE\")","v":2},"+ (add segment)",null,"Refrigeration (Commercial)","Optional",{"$f":"IF(N29=\"NA\",M29,IF(N29=K29,M29,M29*IF(RIGHT(N29,5)=\"CO2-e\",OFFSET(Admin!$AR$3,MATCH(N29,convSources,0),MATCH(K29,convTargets,0)),VLOOKUP(A29&\"-\"&Q29,Admin!BN:BQ,4,FALSE)*OFFSET(Admin!$AR$3,MATCH(N29,convSources,0),MATCH(\"KG\",convTargets,0)))))","v":0},"Tonnes CO2-e","Manual",null,"Tonnes CO2-e","NA",null,"use children"]
["G1","G1.4.3","G1.4","Fugitive EmissionsFRDSegmentSplitAir conditioning",{"$f":"IFERROR(LEN(B30)-LEN(SUBSTITUTE(B30,\".\",\"\") ),\"BAD VALUE\")","v":2},"+ (add segment)",null,"Air conditioning","Optional",{"$f":"IF(N30=\"NA\",M30,IF(N30=K30,M30,M30*IF(RIGHT(N30,5)=\"CO2-e\",OFFSET(Admin!$AR$3,MATCH(N30,convSources,0),MATCH(K30,convTargets,0)),VLOOKUP(A30&\"-\"&Q30,Admin!BN:BQ,4,FALSE)*OFFSET(Admin!$AR$3,MATCH(N30,convSources,0),MATCH(\"KG\",convTargets,0)))))","v":0},"Tonnes CO2-e","Manual",null,"Tonnes CO2-e","NA",null,"use children"]
["G1","G1.4.4","G1.4","Fugitive EmissionsFRDSegmentSplitElectrical equipment",{"$f":"IFERROR(LEN(B31)-LEN(SUBSTITUTE(B31,\".\",\"\") ),\"BAD VALUE\")","v":2},"+ (add segment)",null,"Electrical equipment","Optional",{"$f":"IF(N31=\"NA\",M31,IF(N31=K31,M31,M31*IF(RIGHT(N31,5)=\"CO2-e\",OFFSET(Admin!$AR$3,MATCH(N31,convSources,0),MATCH(K31,convTargets,0)),VLOOKUP(A31&\"-\"&Q31,Admin!BN:BQ,4,FALSE)*OFFSET(Admin!$AR$3,MATCH(N31,convSources,0),MATCH(\"KG\",convTargets,0)))))","v":0},"Tonnes CO2-e","Manual",null,"Tonnes CO2-e","NA",null,"use children"]
["G1","G1.4.5","G1.4","Fugitive EmissionsFRDSegmentSplitFire suppression equipment (fixed)",2,"+ (add segment)",null,"Fire suppression equipment (fixed)","Optional",{"$f":"IF(N32=\"NA\",M32,IF(N32=K32,M32,M32*IF(RIGHT(N32,5)=\"CO2-e\",OFFSET(Admin!$AR$3,MATCH(N32,convSources,0),MATCH(K32,convTargets,0)),VLOOKUP(A32&\"-\"&Q32,Admin!BN:BQ,4,FALSE)*OFFSET(Admin!$AR$3,MATCH(N32,convSources,0),MATCH(\"KG\",convTargets,0)))))","v":0},"Tonnes CO2-e","Manual",null,"Tonnes CO2-e","NA",null,"use children"]
["G1","G1.4.6","G1.4","Fugitive EmissionsFRDSegmentSplitFire suppression equipment (portable)",2,"+ (add segment)",null,"Fire suppression equipment (portable)","Optional",{"$f":"IF(N33=\"NA\",M33,IF(N33=K33,M33,M33*IF(RIGHT(N33,5)=\"CO2-e\",OFFSET(Admin!$AR$3,MATCH(N33,convSources,0),MATCH(K33,convTargets,0)),VLOOKUP(A33&\"-\"&Q33,Admin!BN:BQ,4,FALSE)*OFFSET(Admin!$AR$3,MATCH(N33,convSources,0),MATCH(\"KG\",convTargets,0)))))","v":0},"Tonnes CO2-e","Manual",null,"Tonnes CO2-e","NA",null,"use children"]
["G1","G1.4.7","G1.4","Fugitive EmissionsFRDSegmentSplitOther uses or releases of greenhouse gases through laboratory or workshop use",2,"+ (add segment)",null,"Other uses or releases of greenhouse gases through laboratory or workshop use","Optional",{"$f":"IF(N34=\"NA\",M34,IF(N34=K34,M34,M34*IF(RIGHT(N34,5)=\"CO2-e\",OFFSET(Admin!$AR$3,MATCH(N34,convSources,0),MATCH(K34,convTargets,0)),VLOOKUP(A34&\"-\"&Q34,Admin!BN:BQ,4,FALSE)*OFFSET(Admin!$AR$3,MATCH(N34,convSources,0),MATCH(\"KG\",convTargets,0)))))","v":0},"Tonnes CO2-e","Manual",null,"Tonnes CO2-e","NA",null,"use children"]
["G1","G1.5","G1","Any other material source of direct emissions within the Entity’s organisational boundary ",1,"+ (add segment)",null,"Any other material source of direct emissions within the Entity’s organisational boundary ","Optional",{"$f":"IF(N35=\"NA\",M35,IF(N35=K35,M35,M35*IF(RIGHT(N35,5)=\"CO2-e\",OFFSET(Admin!$AR$3,MATCH(N35,convSources,0),MATCH(K35,convTargets,0)),VLOOKUP(A35&\"-\"&Q35,Admin!BN:BQ,4,FALSE)*OFFSET(Admin!$AR$3,MATCH(N35,convSources,0),MATCH(\"KG\",convTargets,0)))))","v":0},"Tonnes CO2-e","Manual",null,"Tonnes CO2-e","NA",null,"Any other material source of direct emissions within the Entity’s organisational boundary "]
[]
[]
[null,"G2","Total scope two (indirect electricity) greenhouse gas emissions - excluding non-voluntary LGCs (tonnes CO2e)"]
[null,"ID","Parent ID","FRDSegment","Segment Level",null,null,"Description","Flag","Final Value","Final Unit","Input Type","Input Value","Input Unit","CHECK"]
["G2","G2","NA",{"$f":"IF(E40=1,H40,IFERROR(VLOOKUP(C40,$B$14:$D$1048576,3,FALSE)&\"FRDSegmentSplit\"&H40,H40))","v":"GRAND TOTAL"},{"$f":"IFERROR(LEN(B40)-LEN(SUBSTITUTE(B40,\".\",\"\") ),\"BAD VALUE\")","v":0},null,null,"GRAND TOTAL",{"$f":"IF(VLOOKUP(A40,TierIndicators,3,FALSE)=\"Yes\", \"Mandatory\", \"Optional\")","v":"Optional"},{"$f":"M40","v":0},"Tonnes CO2-e","Segment Aggregation",{"$f":"SUMIF(C:C,B40,J:J)","v":0},"Tonnes CO2-e",{"$f":"IF(OR(L40=\"Segment Aggregation\",L40=\"Auto-Calc\"),\"NA\",IF(AND(I40=\"Mandatory\",OR(M40=\"\",N40=\"\")), \"FAIL\", IF(I40=\"Optional\",\"NA\",\"PASS\")))","v":"NA"},null,"GRAND TOTAL"]
["G2","G2.1","G2",{"$f":"IF(E41=1,H41,IFERROR(VLOOKUP(C41,$B$14:$D$1048576,3,FALSE)&\"FRDSegmentSplit\"&H41,H41))","v":"Market-based calculation"},{"$f":"IFERROR(LEN(B41)-LEN(SUBSTITUTE(B41,\".\",\"\") ),\"BAD VALUE\")","v":1},null,null,"Market-based calculation",{"$f":"IF(VLOOKUP(A41,TierIndicators,3,FALSE)=\"Yes\", \"Mandatory\", \"Optional\")","v":"Optional"},{"$f":"M41","v":0},"Tonnes CO2-e","Auto-calc",{"$f":"'Market-based calc'!D19","v":0},"Tonnes CO2-e","NA",null,"Market-based calculation"]
[]
[]
[null,"G3","Total scope three (other indirect) greenhouse gas emissions associated with commercial air travel and waste disposal (tonnes CO2e)"]
[null,"ID","Parent ID","FRDSegment","Segment Level",null,null,"Description","Flag","Final Value","Final Unit","Input Type","Input Value","Input Unit","CHECK"]
["G3","G3","NA",{"$f":"IF(E46=1,H46,IFERROR(VLOOKUP(C46,$B$14:$D$1048576,3,FALSE)&\"FRDSegmentSplit\"&H46,H46))","v":"GRAND TOTAL"},{"$f":"IFERROR(LEN(B46)-LEN(SUBSTITUTE(B46,\".\",\"\") ),\"BAD VALUE\")","v":0},null,null,"GRAND TOTAL",{"$f":"IF(VLOOKUP(A46,TierIndicators,3,FALSE)=\"Yes\", \"Mandatory\", \"Optional\")","v":"Optional"},{"$f":"M46*OFFSET(Admin!$AR$3,MATCH(N46,convSources,0),MATCH(K46,convTargets,0))","v":0},"Tonnes CO2-e","Segment Aggregation",{"$f":"SUMIF(C:C,B46,J:J)","v":0},"Tonnes CO2-e",{"$f":"IF(OR(L46=\"Segment Aggregation\",L46=\"Auto-Calc\"),\"NA\",IF(AND(I46=\"Mandatory\",OR(M46=\"\",N46=\"\")), \"FAIL\", IF(I46=\"Optional\",\"NA\",\"PASS\")))","v":"NA"},null,"GRAND TOTAL"]
["G3","G3.1","G3",{"$f":"IF(E47=1,H47,IFERROR(VLOOKUP(C47,$B$14:$D$1048576,3,FALSE)&\"FRDSegmentSplit\"&H47,H47))","v":"Commercial air travel"},1,"+ (add segment)",null,"Commercial air travel",{"$f":"IF(VLOOKUP(A47,TierIndicators,3,FALSE)=\"Yes\", \"Mandatory\", \"Optional\")","v":"Optional"},{"$f":"M47*OFFSET(Admin!$AR$3,MATCH(N47,convSources,0),MATCH(K47,convTargets,0))","v":0},"Tonnes CO2-e","Manual",null,"Tonnes CO2-e",{"$f":"IF(OR(L47=\"Segment Aggregation\",L47=\"Auto-Calc\"),\"NA\",IF(AND(I47=\"Mandatory\",OR(M47=\"\",N47=\"\")), \"FAIL\", IF(I47=\"Optional\",\"NA\",\"PASS\")))","v":"NA"},null,"Individual flight greenhouse gas emissions data supplied (calculated from imported data)",{"$f":"IF(VLOOKUP(A47,Calculations,MATCH(\"data imported?\",Admin!$Q$2:$V$2,0),0),\"calculation available\",\"import data from home tab to use calculations\")","v":"import data from home tab to use calculations"}]
["G3","G3.2","G3",{"$f":"IF(E48=1,H48,IFERROR(VLOOKUP(C48,$B$14:$D$1048576,3,FALSE)&\"FRDSegmentSplit\"&H48,H48))","v":"Waste emissions"},1,null,null,"Waste emissions",{"$f":"IF(VLOOKUP(A48,TierIndicators,3,FALSE)=\"Yes\", \"Mandatory\", \"Optional\")","v":"Optional"},{"$f":"M48*OFFSET(Admin!$AR$3,MATCH(N48,convSources,0),MATCH(K48,convTargets,0))","v":0},"Tonnes CO2-e","Auto-calc",{"$f":"'Waste and Recycling'!M50","v":0},"Tonnes CO2-e","NA",null,"Waste emissions"]
[]
[]
[null,"G4","Optional - Total scope three (other indirect) greenhouse gas emissions associated with activities outside the organisational boundary of the entity (tonnes CO2-e)"]
[null,"ID","Parent ID","FRDSegment","Segment Level",null,null,"Description","Flag","Final Value","Final Unit","Input Type","Input Value","Input Unit","CHECK"]
["G4","G4","NA",{"$f":"IF(E53=1,H53,IFERROR(VLOOKUP(C53,$B$14:$D$1048576,3,FALSE)&\"FRDSegmentSplit\"&H53,H53))","v":"GRAND TOTAL"},{"$f":"IFERROR(LEN(B53)-LEN(SUBSTITUTE(B53,\".\",\"\") ),\"BAD VALUE\")","v":0},null,null,"GRAND TOTAL",{"$f":"IF(VLOOKUP(A53,TierIndicators,3,FALSE)=\"Yes\", \"Mandatory\", \"Optional\")","v":"Optional"},{"$f":"M53*OFFSET(Admin!$AR$3,MATCH(N53,convSources,0),MATCH(K53,convTargets,0))","v":0},"Tonnes CO2-e","Segment Aggregation",{"$f":"SUMIF(C:C,B53,J:J)","v":0},"Tonnes CO2-e",{"$f":"IF(OR(L53=\"Segment Aggregation\",L53=\"Auto-Calc\"),\"NA\",IF(AND(I53=\"Mandatory\",OR(M53=\"\",N53=\"\")), \"FAIL\", IF(I53=\"Optional\",\"NA\",\"PASS\")))","v":"NA"},null,"GRAND TOTAL"]
["G4","G4.1","G4",{"$f":"IF(E54=1,H54,IFERROR(VLOOKUP(C54,$B$14:$D$1048576,3,FALSE)&\"FRDSegmentSplit\"&H54,H54))","v":"Total scope three (other indirect) greenhouse gas emissions associated with activities outside the organisational boundary of the entity"},{"$f":"IFERROR(LEN(B54)-LEN(SUBSTITUTE(B54,\".\",\"\") ),\"BAD VALUE\")","v":1},"+ (add segment)",null,"Total scope three (other indirect) greenhouse gas emissions associated with activities outside the organisational boundary of the entity",{"$f":"IF(VLOOKUP(A54,TierIndicators,3,FALSE)=\"Yes\", \"Mandatory\", \"Optional\")","v":"Optional"},{"$f":"M54*OFFSET(Admin!$AR$3,MATCH(N54,convSources,0),MATCH(K54,convTargets,0))","v":0},"Tonnes CO2-e","Manual",null,"Tonnes CO2-e","NA",null,"Value to use (selected from below in decreasing order of preference)"]
[]
[]
[null,"G5","Optional - Any other known greenhouse gas emissions associated with other activities (tonnes CO2-e)"]
[null,"ID","Parent ID","FRDSegment","Segment Level",null,null,"Description","Flag","Final Value","Final Unit","Input Type","Input Value","Input Unit","CHECK"]
["G5","G5","NA",{"$f":"IF(E59=1,H59,IFERROR(VLOOKUP(C59,$B$14:$D$1048576,3,FALSE)&\"FRDSegmentSplit\"&H59,H59))","v":"GRAND TOTAL"},{"$f":"IFERROR(LEN(B59)-LEN(SUBSTITUTE(B59,\".\",\"\") ),\"BAD VALUE\")","v":0},null,null,"GRAND TOTAL",{"$f":"IF(VLOOKUP(A59,TierIndicators,3,FALSE)=\"Yes\", \"Mandatory\", \"Optional\")","v":"Optional"},{"$f":"M59*OFFSET(Admin!$AR$3,MATCH(N59,convSources,0),MATCH(K59,convTargets,0))","v":0},"Tonnes CO2-e","Segment Aggregation",{"$f":"SUMIF(C:C,B59,J:J)","v":0},"Tonnes CO2-e",{"$f":"IF(OR(L59=\"Segment Aggregation\",L59=\"Auto-Calc\"),\"NA\",IF(AND(I59=\"Mandatory\",OR(M59=\"\",N59=\"\")), \"FAIL\", IF(I59=\"Optional\",\"NA\",\"PASS\")))","v":"NA"},null,"GRAND TOTAL\n"]
["G5","G5.1","G5",{"$f":"IF(E60=1,H60,IFERROR(VLOOKUP(C60,$B$14:$D$1048576,3,FALSE)&\"FRDSegmentSplit\"&H60,H60))","v":"Any other known greenhouse gas emissions associated with other activities (tonnes CO2-e)"},{"$f":"IFERROR(LEN(B60)-LEN(SUBSTITUTE(B60,\".\",\"\") ),\"BAD VALUE\")","v":1},"+ (add segment)",null,"Any other known greenhouse gas emissions associated with other activities (tonnes CO2-e)",{"$f":"IF(VLOOKUP(A60,TierIndicators,3,FALSE)=\"Yes\", \"Mandatory\", \"Optional\")","v":"Optional"},{"$f":"M60*OFFSET(Admin!$AR$3,MATCH(N60,convSources,0),MATCH(K60,convTargets,0))","v":0},"Tonnes CO2-e","Manual",null,"Tonnes CO2-e","NA",null,"Any other known greenhouse gas emissions associated with other activities (tonnes CO2-e)"]
[]
[]
[null,"G6","Optional - Total greenhouse gas emission offsets purchased and retired segmented by activity type (e.g., natural gas, vehicle fleet, air travel) (tonnes CO2-e)"]
[null,"ID","Parent ID","FRDSegment","Segment Level",null,null,"Description","Flag","Final Value","Final Unit","Input Type","Input Value","Input Unit","CHECK"]
["G6","G6","NA",{"$f":"IF(E65=1,H65,IFERROR(VLOOKUP(C65,$B$14:$D$1048576,3,FALSE)&\"FRDSegmentSplit\"&H65,H65))","v":"GRAND TOTAL"},{"$f":"IFERROR(LEN(B65)-LEN(SUBSTITUTE(B65,\".\",\"\") ),\"BAD VALUE\")","v":0},null,null,"GRAND TOTAL",{"$f":"IF(VLOOKUP(A65,TierIndicators,3,FALSE)=\"Yes\", \"Mandatory\", \"Optional\")","v":"Optional"},{"$f":"M65*OFFSET(Admin!$AR$3,MATCH(N65,convSources,0),MATCH(K65,convTargets,0))","v":0},"Tonnes CO2-e","Segment Aggregation",{"$f":"SUMIF(C:C,B65,J:J)","v":0},"Tonnes CO2-e",{"$f":"IF(OR(L65=\"Segment Aggregation\",L65=\"Auto-Calc\"),\"NA\",IF(AND(I65=\"Mandatory\",OR(M65=\"\",N65=\"\")), \"FAIL\", IF(I65=\"Optional\",\"NA\",\"PASS\")))","v":"NA"},null,"GRAND TOTAL\n"]
["G6","G6.1","G6",{"$f":"IF(E66=1,H66,IFERROR(VLOOKUP(C66,$B$14:$D$1048576,3,FALSE)&\"FRDSegmentSplit\"&H66,H66))","v":"Total greenhouse gas emission offsets purchased and retired segmented by activity type (e.g., natural gas, vehicle fleet, air travel) (tonnes CO2-e)"},{"$f":"IFERROR(LEN(B66)-LEN(SUBSTITUTE(B66,\".\",\"\") ),\"BAD VALUE\")","v":1},"+ (add segment)",null,"Total greenhouse gas emission offsets purchased and retired segmented by activity type (e.g., natural gas, vehicle fleet, air travel) (tonnes CO2-e)",{"$f":"IF(VLOOKUP(A66,TierIndicators,3,FALSE)=\"Yes\", \"Mandatory\", \"Optional\")","v":"Optional"},{"$f":"M66*OFFSET(Admin!$AR$3,MATCH(N66,convSources,0),MATCH(K66,convTargets,0))","v":0},"Tonnes CO2-e","Manual",null,"Tonnes CO2-e","NA",null,"Total greenhouse gas emission offsets purchased and retired segmented by activity type (e.g., natural gas, vehicle fleet, air travel) (tonnes CO2-e)"]
[]
[]
[null,"G7","Optional - Net greenhouse gas emissions segmented into scope one (direct), scope two (indirect electricity) and scope three (indirect other) [calculated by total greenhouse gas emissions minus retired offsets] (tonnes CO2-e)"]
[null,"ID","Parent ID","FRDSegment","Segment Level",null,null,"Description","Flag","Final Value","Final Unit","Input Type","Input Value","Input Unit","CHECK"]
["G7","G7","NA",{"$f":"IF(E71=1,H71,IFERROR(VLOOKUP(C71,$B$14:$D$1048576,3,FALSE)&\"FRDSegmentSplit\"&H71,H71))","v":"GRAND TOTAL"},{"$f":"IFERROR(LEN(B71)-LEN(SUBSTITUTE(B71,\".\",\"\") ),\"BAD VALUE\")","v":0},null,null,"GRAND TOTAL",{"$f":"IF(VLOOKUP(A71,TierIndicators,3,FALSE)=\"Yes\", \"Mandatory\", \"Optional\")","v":"Optional"},{"$f":"M71*OFFSET(Admin!$AR$3,MATCH(N71,convSources,0),MATCH(K71,convTargets,0))","v":0},"Tonnes CO2-e","Segment Aggregation",{"$f":"SUMIF(C:C,B71,J:J)","v":0},"Tonnes CO2-e",{"$f":"IF(OR(L71=\"Segment Aggregation\",L71=\"Auto-Calc\"),\"NA\",IF(AND(I71=\"Mandatory\",OR(M71=\"\",N71=\"\")), \"FAIL\", IF(I71=\"Optional\",\"NA\",\"PASS\")))","v":"NA"},null,"GRAND TOTAL\n"]
["G7","G7.1","G7",{"$f":"IF(E72=1,H72,IFERROR(VLOOKUP(C72,$B$14:$D$1048576,3,FALSE)&\"FRDSegmentSplit\"&H72,H72))","v":"Net greenhouse gas emissions segmented into scope one (direct), scope two (indirect electricity) and scope three (indirect other) [calculated by total greenhouse gas emissions minus retired offsets] (tonnes CO2-e)"},{"$f":"IFERROR(LEN(B72)-LEN(SUBSTITUTE(B72,\".\",\"\") ),\"BAD VALUE\")","v":1},null,null,"Net greenhouse gas emissions segmented into scope one (direct), scope two (indirect electricity) and scope three (indirect other) [calculated by total greenhouse gas emissions minus retired offsets] (tonnes CO2-e)",{"$f":"IF(VLOOKUP(A72,TierIndicators,3,FALSE)=\"Yes\", \"Mandatory\", \"Optional\")","v":"Optional"},{"$f":"M72*OFFSET(Admin!$AR$3,MATCH(N72,convSources,0),MATCH(K72,convTargets,0))","v":0},"Tonnes CO2-e","Segment Aggregation",{"$f":"SUMIF(C:C,B72,J:J)","v":0},"Tonnes CO2-e","NA",null,"Net greenhouse gas emissions segmented into scope one (direct), scope two (indirect electricity) and scope three (indirect other) [calculated by total greenhouse gas emissions minus retired offsets] (tonnes CO2-e)"]
["G7",{"$f":"C73 & \".\" & COUNTIF($C$1:OFFSET(C73,-1,0),C73) +1","v":"G7.1.1"},"G7.1",{"$f":"IF(E73=1,H73,IFERROR(VLOOKUP(C73,$B$14:$D$1048576,3,FALSE)&\"FRDSegmentSplit\"&H73,H73))","v":"Net greenhouse gas emissions segmented into scope one (direct), scope two (indirect electricity) and scope three (indirect other) [calculated by total greenhouse gas emissions minus retired offsets] (tonnes CO2-e)FRDSegmentSplitScope one (direct)"},{"$f":"IFERROR(LEN(B73)-LEN(SUBSTITUTE(B73,\".\",\"\") ),\"BAD VALUE\")","v":2},"+ (add segment)",null,"Scope one (direct)",{"$f":"IF(VLOOKUP(A73,TierIndicators,3,FALSE)=\"Yes\", \"Mandatory\", \"Optional\")","v":"Optional"},{"$f":"M73*OFFSET(Admin!$AR$3,MATCH(N73,convSources,0),MATCH(K73,convTargets,0))","v":0},"Tonnes CO2-e","Manual",null,"Tonnes CO2-e","NA",null,"Scope one (direct)"]
["G7",{"$f":"C74 & \".\" & COUNTIF($C$1:OFFSET(C74,-1,0),C74) +1","v":"G7.1.2"},"G7.1",{"$f":"IF(E74=1,H74,IFERROR(VLOOKUP(C74,$B$14:$D$1048576,3,FALSE)&\"FRDSegmentSplit\"&H74,H74))","v":"Net greenhouse gas emissions segmented into scope one (direct), scope two (indirect electricity) and scope three (indirect other) [calculated by total greenhouse gas emissions minus retired offsets] (tonnes CO2-e)FRDSegmentSplitScope two (indirect electricity)"},{"$f":"IFERROR(LEN(B74)-LEN(SUBSTITUTE(B74,\".\",\"\") ),\"BAD VALUE\")","v":2},"+ (add segment)",null,"Scope two (indirect electricity)",{"$f":"IF(VLOOKUP(A74,TierIndicators,3,FALSE)=\"Yes\", \"Mandatory\", \"Optional\")","v":"Optional"},{"$f":"M74*OFFSET(Admin!$AR$3,MATCH(N74,convSources,0),MATCH(K74,convTargets,0))","v":0},"Tonnes CO2-e","Manual",null,"Tonnes CO2-e","NA",null,"Scope two (indirect electricity)"]
["G7",{"$f":"C75 & \".\" & COUNTIF($C$1:OFFSET(C75,-1,0),C75) +1","v":"G7.1.3"},"G7.1",{"$f":"IF(E75=1,H75,IFERROR(VLOOKUP(C75,$B$14:$D$1048576,3,FALSE)&\"FRDSegmentSplit\"&H75,H75))","v":"Net greenhouse gas emissions segmented into scope one (direct), scope two (indirect electricity) and scope three (indirect other) [calculated by total greenhouse gas emissions minus retired offsets] (tonnes CO2-e)FRDSegmentSplitScope three (indirect other)"},{"$f":"IFERROR(LEN(B75)-LEN(SUBSTITUTE(B75,\".\",\"\") ),\"BAD VALUE\")","v":2},"+ (add segment)",null,"Scope three (indirect other)",{"$f":"IF(VLOOKUP(A75,TierIndicators,3,FALSE)=\"Yes\", \"Mandatory\", \"Optional\")","v":"Optional"},{"$f":"M75*OFFSET(Admin!$AR$3,MATCH(N75,convSources,0),MATCH(K75,convTargets,0))","v":0},"Tonnes CO2-e","Manual",null,"Tonnes CO2-e","NA",null,"Scope three (indirect other)"]

{"sheet":"ExportDataTable","index":16,"n_rows":1,"n_cols":28,"rows_kept":1,"cut":false,"hidden":false,"merged":[]}
["DCT Version Number","Entity","Tier","Reporting Period","Indicator Category","Indicator","Indicator Description","FRDSegment","ID","Parent ID","Segment Level","Description","Flag","Final Value","Final Unit","Input Type","Input Value","Input Unit","Segment Level 1","Segment Level 2","Segment Level 3","Segment Level 4","Segment Level 5","Segment Level 6","Segment Level 7","Segment Level 8","Segment Level 9","Segment Level 10"]

{"sheet":"Monthly Collection Waste","index":17,"n_rows":1,"n_cols":19,"rows_kept":1,"cut":false,"hidden":false,"merged":[]}
["Index ()","Customer Number","Name","Site Name","City","State","Waste Type Description","Serv. Code","Cont. Type","Date","Group","Weight Recorded","Qty. Serviced","Default Weight Per Unit","Default Weight Total","Weight","Volume","Disposal Stream","Waste Stream"]

{"sheet":"Carbon Emission Report Details","index":18,"n_rows":5,"n_cols":24,"rows_kept":5,"cut":false,"hidden":false,"merged":[[0,0,0,7],[1,0,1,7],[2,0,2,7]]}
["Corporate Travel Management - Carbon Emission Report ( Air, Hotel & Car)"]
["Debtor:   Department of Environment, Land, Water and Planning (DELWP)"]
["Date Type: Service Date : 7/1/2020 1 to 6/30/2021 "]
[]
["Client Group","Debtor","Booking Code","Booking Date","Service Date","Last Service Date","PNR","Documentnumber","Traveller Name","Booked By","Card Type","Card Holder","Card Number","Destination Country","Destination City","Itinerary Summary","Unit Count","Mileage","Kilometers","Service Provider","Service Provider Type","Carbon Emission (DEFRA select RF)","Emission Tonnes CO2e","Carbon Offset Cost"]

{"sheet":"Energy Data (imported)","index":19,"n_rows":11,"n_cols":6,"rows_kept":11,"cut":false,"hidden":false,"merged":[]}
[]
[]
["Report Name:","FRD24 Data"]
["Custom Report:","Multi-Service Cost and Usage"]
["Client:","Victorian Government"]
["Level:","Site"]
["Filters:","Separate Estimated and Actual Data:Yes"]
["Date Range:","7/1/2020 to 6/30/2021"]
["Units of Measure:","Currency:AUD, Area:Sq. Ft."]
[]
["Division","Site","Services","Service Month","Total Usage","Usage UOM"]

{"sheet":"Market-based calc","index":20,"n_rows":19,"n_cols":5,"rows_kept":19,"cut":false,"hidden":true,"merged":[]}
[null,"National Scope 2",{"$f":"Admin!F2","v":0.68}]
[null,"RPP",{"$f":"Admin!F3","v":0.18640000000000001}]
[null,"National RMF scope 2",0.95499999999999996]
[]
[null,"Market Based Approach Summary "]
[null,"Market Based Approach ","Activity Data (kWh)","Emissions \n(kgCO2e)","Renewable Percentage of total "]
[null,"Behind the meter consumption of electricity generated",{"$f":" (  'Electricity Use'!J24 - ('Electricity Use'!J30+'Electricity Use'!J31)-'Electricity Use'!J73  ) * 1000","v":0},{"$f":"$C7*0","v":0},{"$f":"IF(D7<0,0,C7/$C$14)","v":{"$error":"#DIV/0!"}}]
[null,"Total non-grid electricity ",{"$f":"C7","v":0},{"$f":"D7","v":0},{"$f":"SUM(E7)","v":{"$error":"#DIV/0!"}}]
[null,"LGC Purchased and retired (kWh) (including PPAs & Precinct LGCs)",{"$f":"(  'Electricity Use'!J67 + 'Electricity Use'!J68  ) * 1000","v":0},{"$f":"$C9*0","v":0},{"$f":"IF(D9>0,0,C9/$C$14)","v":{"$error":"#DIV/0!"}}]
[null,"GreenPower",{"$f":"'Electricity Use'!J70 * 1000","v":0},{"$f":"$C10*0","v":0},{"$f":"IF(D10>0,0,C10/$C$14)","v":{"$error":"#DIV/0!"}}]
[null,"Large Scale Renewable Energy Target (applied to grid electricity only) ",{"$f":"C13*C2","v":0},{"$f":"$C11*0","v":0},{"$error":"#DIV/0!"}]
[null,"Residual Electricity ",{"$f":"C13-SUM(C9:C11)","v":0},{"$f":"$C12*C3","v":0},{"$error":"#DIV/0!"}]
[null,"Total grid electricity ",{"$f":"C14-C8","v":0},{"$f":"SUM(D9:D12)","v":0},{"$f":"SUM(E9:E12)","v":{"$error":"#DIV/0!"}}]
[null,"Total Electricity Consumed (grid + non grid)",{"$f":"('Electricity Use'!J15-'Electricity Use'!M30-'Electricity Use'!M31)*1000","v":0},{"$f":"D8+D13","v":0},{"$f":"C15/C14","v":{"$error":"#DIV/0!"}}]
[null,"Electricity renewables ",{"$f":"C8+SUM(C9:C11)","v":0},0]
[null,"Residual Electricity ",{"$f":"C14-C15","v":0},{"$f":"D13","v":0}]
[null,"Exported on-site generated electricity",0,0]
[null,"Emissions (kgCO2e) ",null,{"$f":"MAX(D16+D17,0)","v":0}]
[null,"Emissions (tCO2e) ",null,{"$f":"D18/1000","v":0}]

{"sheet":"Admin","index":21,"n_rows":180,"n_cols":96,"rows_kept":180,"cut":false,"hidden":true,"merged":[[7,4,10,4],[0,69,0,72],[0,88,0,90],[0,4,0,5],[0,7,0,8],[0,16,0,21],[0,23,0,27],[0,63,0,67],[0,82,0,86],[0,42,0,61]]}
["DCT Version Number",null,"Reporting Period",null,"Market-based calculation - adjust values as needed",null,null,"Normalisation Factors",null,null,"Input - Normal","Input - with calc",null,null,"Disposal Stream",null,"Calculations",null,null,null,null,null,null,"Input Units",null,null,null,null,null,null,null,"Indicator","Indicator Title","Currently Selected -DO NOT MODIFY","Indicator Sheet","Tier 1","Tier 2","Tier 3a","Tier 3b","Tier 3s","Tier 4",null,"CONVERSION TABLE",null,null,null,null,null,null,null,null,null,null,null,null,null,null,null,null,null,null,null,null,"Emissions Factors",null,null,null,null,"Update this number from NGA","Cross-Unit Conversions",null,null,null,null,null,null,null,null,null,null,null,null,"B4 & B5 drop-downs",null,null,null,null,null,"HeaderInfo and Helpers for VBA Iteration / Named Ranges",null,null,null,"Column","ExportDataTable Field Name","MapType","MapHelper"]
["v1.01",null,"1 Jan - 31 Dec (Calendar Year)",null,"National Scope 2",0.68,null,"B6","W2 & WR3",null,"Manual","Manual",null,null,"Landfill (disposal)",null,"Indicator ID","Datasheet","Description","Data starts at row #","Data imported?","Formula",null,"G1","F1-KG","F1-Both","F1-Natural Gas","WR-M3",null,"Unit",null,"EL1","Total electricity consumption segmented by source",{"$f":"IF(Tier=\"\",\"\",INDEX(AJ2:AO2,MATCH(Tier,$AJ$1:$AO$1,0)))","v":""},"Electricity Use","Yes","Yes","Yes","Yes","Yes","Yes",null,null,null,null,null,null,null,null,null,null,null,null,null,null,null,null,null,null,null,null,null,null,"Indicator","Type","Concat","Source Unit","Emissions Factor kgCO2-e","Emissions Factor tonnes CO2-e","convFromLitres","convFromKG","convFromM3","convFromKL","GWP","Leakage rate","Emissions Factor kg CO2","Emissions Factor kg CH4","Emissions Factor kg N2O","Emissions Factor tonnes CO2","Emissions Factor tonnes CH4","Emissions Factor tonnes N2O",null,"Rating system","NABERS","Green Star","NatHERS","ISCA",null,"CurrentIndicator","CurrentSheet","CurrentDescription",null,1,"DCT Version Number","val",{"$f":"versionNumber","v":"v1.01"}]
[null,null,"1 Jul - 30 Jun (Financial Year)",null,"RPP",0.18640000000000001,null,"FTE","FTE",null,"Estimate","Estimate",null,null,"Recycling/recovery (disposal)",null,"EL1","Energy Data (imported)","Purchased directly through an electricity retailer",12,{"$f":"INDIRECT(\"'\"&R3&\"'!$A$\"&T3)<>\"\"","v":false},"=SUMIF(INDIRECT(\"'\"&Admin!R$3&\"'!C:C\"), \"Electric Power\",INDIRECT(\"'\"&Admin!R$3&\"'!E:E\"))",null,"Tonnes CO2-e","KWh","KWh","KWh","Tonnes",null,"L",null,"EL2","On site-electricity generated (in megawatt hours) for large-scale renewable energy systems, (i.e. accredited under the Large-Scale Renewable Energy Target (RET)), small-scale renewable energy systems (where data is available), and any other electricity generation system (where data is available), segmented by:","","Electricity Use","Yes","Yes","Yes","Yes","Yes",null,null,null,"Source\\Target","MWh","KWh","KJ","MJ","GJ","TJ","Tonnes","KG","ML (water)","kL (water)","L (water)","Km","m","Miles","MW","KW","Tonnes CO2-e","KG CO2-e",null,"F2","Natural Gas",{"$f":"BL3& \"-\"&BM3","v":"F2-Natural Gas"},"GJ",{"$f":"SUM(BX3:BZ3)","v":51.53},{"$f":"BP3/1000","v":5.1529999999999999E-2},null,null,{"$f":"39.3*(10^-3)","v":3.9299999999999995E-2},null,null,null,51.4,0.1,0.03,{"$f":"BX3/1000","v":5.1400000000000001E-2},{"$f":"BY3/1000","v":1E-4},2.9999999999999997E-5,null,"NABERS Energy",0,4,0,25,null,"G7",{"$f":"VLOOKUP(CurrentIndicator,TierIndicators,4,FALSE)","v":"Greenhouse Gas Emissions"},{"$f":"VLOOKUP(CurrentIndicator,TierIndicators,2,FALSE)","v":"Optional - Net greenhouse gas emissions segmented into scope one (direct), scope two (indirect electricity) and scope three (indirect other) [calculated by total greenhouse gas emissions minus retired offsets] (tonnes CO2-e)"},null,2,"Entity","val",{"$f":"Agency","v":0}]
["NGA Factors (year)",null,"1 Apr - 30 Mar",null,null,null,null,"headcount","headcount",null,"Not Available -> Provide Comment","Not Available -> Provide Comment",null,null,"Other",null,"EL4","Energy Data (imported)","GreenPower or certified carbon neutral electricity purchased (eg. Through a retailer's contract option)",12,{"$f":"INDIRECT(\"'\"&R4&\"'!$A$\"&T4)<>\"\"","v":false},"=SUMIF(INDIRECT(\"'\"&Admin!R$4&\"'!C:C\"), \"Green Power\",INDIRECT(\"'\"&Admin!R$4&\"'!E:E\"))",null,"KG CO2-e","MWh","MWh","MWh","Kg",null,"Tonnes",null,"EL3","On-site installed generation capacity in megawatts (as at end of reporting period) segment by:","","Electricity Use","Yes","Yes","Yes","Yes","Yes",null,null,"Energy","MWh",1,1000,3600000,3600,3.6,3.5999971200023038E-3,null,null,null,null,null,null,null,null,null,null,null,null,null,"F2","LPG",{"$f":"BL4& \"-\"&BM4","v":"F2-LPG"},"GJ",{"$f":"SUM(BX4:BZ4)","v":60.600000000000009},{"$f":"BP4/1000","v":6.0600000000000008E-2},{"$f":"BU4/1000","v":2.5700000000000001E-2},{"$f":"1.96*25.7/1000","v":5.0372E-2},null,25.7,null,null,60.2,0.2,0.2,{"$f":"BX4/1000","v":6.0200000000000004E-2},{"$f":"BY4/1000","v":2.0000000000000001E-4},{"$f":"BZ4/1000","v":2.0000000000000001E-4},null,"NABERS Water",1,5,1,26,null,null,null,null,null,3,"Tier","val",{"$f":"Tier","v":0}]
[2022,null,"Other",null,null,null,null,"floor area (m2)","floor area (m2)",null,null,"Calculation",null,null,null,null,"F1","Energy Data (imported)","Natural gas (buildings)",12,{"$f":"INDIRECT(\"'\"&R5&\"'!$A$\"&T5)<>\"\"","v":false},"=SUMIF(INDIRECT(\"'\"&Admin!R$5&\"'!C:C\"), \"Natural Gas\",INDIRECT(\"'\"&Admin!R$5&\"'!E:E\"))",null,"Tonnes","KJ","KJ","KJ","m3",null,"KG",null,"EL4","Total electricity offsets segmented by offset type","","Electricity Use","Yes","Yes","Yes","Yes","Yes","Yes",null,"Energy","KWh",1E-3,1,3600,3.6,3.5999999999999999E-3,3.5999999999711999E-6,null,null,null,null,null,null,null,null,null,null,null,null,null,"F2","Diesel","F2-Diesel","GJ",70.2,{"$f":"BP5/1000","v":7.0199999999999999E-2},{"$f":"BU5/1000","v":3.8600000000000002E-2},null,null,38.6,null,null,69.900000000000006,0.1,0.2,6.9900000000000004E-2,1E-4,2.0000000000000001E-4,null,"NABERS Indoor Environment",2,6,2,27,null,null,null,null,null,4,"Reporting Period","val",{"$f":"ReportingPeriod","v":" - "}]
[null,null,null,null,null,null,null,"other","other",null,null,null,null,null,null,null,"T4","Carbon Emission Report Details","Total distance travelled by commercial air travel (passenger km travelled for business purposes by entity staff on commercial or charter aircraft)",6,{"$f":"INDIRECT(\"'\"&R6&\"'!$A$\"&T6)<>\"\"","v":false},"=SUMIF(INDIRECT(\"'\"&Admin!R$6&\"'!U:U\"),\"Air Travel\",INDIRECT(\"'\"&Admin!R$6&\"'!S:S\"))",null,"KG","MJ","MJ","MJ",null,null,"m3",null,"F1","Total fuels used in buildings and machinery segmented by fuel type (MJ)","","Stationary Fuel Use","Yes","Yes","Yes","Yes","Yes",null,null,"Energy","KJ",2.7777777777777776E-7,2.7777800000000001E-4,1,1E-3,9.9999999999999995E-7,1.0000000000000001E-9,null,null,null,null,null,null,null,null,null,null,null,null,null,"F2","Petrol","F2-Petrol","GJ",67.800000000000011,{"$f":"BP6/1000","v":6.7800000000000013E-2},3.4200000000000001E-2,null,null,34.200000000000003,null,null,67.400000000000006,0.2,0.2,6.7400000000000002E-2,2.0000000000000001E-4,2.0000000000000001E-4,null,"NABERS Waste",3,null,3,28,null,null,null,null,null,5,"Indicator Category","val",{"$f":"CurrentSheet","v":"Greenhouse Gas Emissions"}]
[null,null,null,null,null,null,null,null,null,null,null,null,null,null,null,null,"G3","Carbon Emission Report Details","Total scope three (other indirect) greenhouse gas emissions associated with commercial air travel (tCO2-e)",6,{"$f":"INDIRECT(\"'\"&R7&\"'!$A$\"&T7)<>\"\"","v":false},"=SUMIF(INDIRECT(\"'\"&Admin!R$7&\"'!U:U\"),\"Air Travel\",INDIRECT(\"'\"&Admin!R$7&\"'!W:W\"))",null,null,"GJ","GJ","GJ",null,null,null,null,"F2","Greenhouse gas emissions from stationary fuel consumption segmented by fuel type (Tonnes CO2-e)","","Stationary Fuel Use","Yes","Yes","Yes","Yes","Yes",null,null,"Energy","MJ",2.7777777777777778E-4,0.27777777777777779,1000,1,1E-3,9.9999999999999995E-7,null,null,null,null,null,null,null,null,null,null,null,null,null,"F2","Hydrogen","F2-Hydrogen","MJ","DIRECT","DIRECT",null,120,null,null,null,null,"DIRECT","DIRECT","DIRECT","DIRECT","DIRECT","DIRECT",null,"Green Star Communities",4,null,4,29,null,null,null,null,null,6,"Indicator","val",{"$f":"CurrentIndicator","v":"G7"}]
[null,null,null,null,"NB - update the RPP here and then use RMFs supplied by Climate Active to update the Market-based calc sheet",null,null,null,null,null,null,null,null,null,null,null,"WR1","Monthly Collection Waste","Total units of waste disposed of by waste stream and disposal method",2,{"$f":"INDIRECT(\"'\"&R8&\"'!$A$\"&T8)<>\"\"","v":false},"=SUMIFS(INDIRECT(\"'\"&Admin!R$8&\"'!O:O\"), INDIRECT(\"'\"&Admin!R$8&\"'!R:R\"),OFFSET(INDIRECT(ADDRESS(ROW(),COLUMN())),0,3),INDIRECT(\"'\"&Admin!R$8&\"'!S:S\"),OFFSET(INDIRECT(ADDRESS(ROW(),COLUMN())),0,-5))",null,null,"TJ","TJ","TJ",null,null,null,null,"T1","Total energy used in transportation within the Entity, segmented by fuel type and vehicle category","","Transportation","Yes","Yes","Yes","Yes","Yes",null,null,"Energy","GJ",0.27777777777777779,277.77800000000002,1000000,1000,1,1E-3,null,null,null,null,null,null,null,null,null,null,null,null,null,"F2","Dry wood","F2-Dry wood","GJ",1.2000000000000002,{"$f":"BP8/1000","v":1.2000000000000001E-3},null,1.6199999999999999E-2,null,null,null,null,0,0.1,1.1000000000000001,0,{"$f":"BY8/1000","v":1E-4},{"$f":"BZ8/1000","v":1.1000000000000001E-3},null,"Green Star Design & As Built",5,null,5,30,null,null,null,null,null,7,"Indicator Description","val",{"$f":"CurrentDescription","v":"Optional - Net greenhouse gas emissions segmented into scope one (direct), scope two (indirect electricity) and scope three (indirect other) [calculated by total greenhouse gas emissions minus retired offsets] (tonnes CO2-e)"}]
[null,null,null,null,null,null,null,null,null,null,null,null,null,null,null,null,null,null,null,null,null,null,null,null,"Kg","L","m3",null,null,null,null,"T2","Number and proportion of vehicles in the organisational boundary segmented by engine/fuel type and vehicle category","","Transportation","Yes","Yes","Yes","Yes","Yes","Yes",null,"Energy","TJ",277.77800000000002,277777.77778,1000000000,1000000,1000,1,null,null,null,null,null,null,null,null,null,null,null,null,null,"F2","Green and air dried wood","F2-Green and air dried wood","GJ",1.2000000000000002,1.2000000000000001E-3,null,1.04E-2,null,null,null,null,0,0.1,1.1000000000000001,{"$f":"BX9/1000","v":0},{"$f":"BY9/1000","v":1E-4},{"$f":"BZ9/1000","v":1.1000000000000001E-3},null,"Green Star Interiors",6,null,6,31,null,null,null,null,null,8,"FRDSegment","cellref",{"$f":"MATCH(CP9,'Electricity Use'!$B$14:$N$14,0)","v":3}]
[null,null,null,null,null,null,null,null,null,null,null,null,null,null,null,null,null,null,null,null,null,null,null,null,"Tonnes","kL",null,null,null,null,null,"T3","Greenhouse gas emissions from vehicle fleet segmented by fuel type and vehicle category (tonnes CO2-e)","","Transportation","Yes","Yes","Yes","Yes","Yes",null,null,"Weight","Tonnes",null,null,null,null,null,null,1,1000,null,null,null,null,null,null,null,null,null,null,null,"F2","Bagasse","F2-Bagasse","GJ",1.4000000000000001,1.4000000000000002E-3,null,9.5999999999999992E-3,null,null,null,null,0,0.3,1.1000000000000001,0,2.9999999999999997E-4,1.1000000000000001E-3,null,"Green Star Performance",null,null,7,32,null,null,null,null,null,9,"ID","cellref",{"$f":"MATCH(CP10,'Electricity Use'!$B$14:$N$14,0)","v":1}]
[null,null,null,null,null,null,null,null,null,null,null,null,null,null,null,null,null,null,null,null,null,null,null,null,null,"Kg",null,null,null,null,null,"T4","Total distance travelled by commercial air travel (passenger km travelled for business purposes by entity staff on commercial or charter aircraft)","","Transportation","Yes","Yes","Yes",null,null,null,null,"Weight","KG",null,null,null,null,null,null,1E-3,1,null,null,null,null,null,null,null,null,null,null,null,"F2","Biomass municipal and other industrial materials","F2-Biomass municipal and other industrial materials","GJ",1.8,1.8E-3,null,1.2200000000000001E-2,null,null,null,null,0,0.8,1,0,8.0000000000000004E-4,1E-3,null,"NatHERS (single dwelling)",null,null,8,33,null,null,null,null,null,10,"Parent ID","cellref",{"$f":"MATCH(CP11,'Electricity Use'!$B$14:$N$14,0)","v":2}]
[null,null,null,null,null,null,null,null,null,null,null,null,null,null,null,null,null,null,null,null,null,null,null,null,null,null,null,null,null,null,null,"E1","Total energy usage from fuels, including stationary fuels (F1) and transport fuels (T1)","","Total Energy Use","Yes","Yes","Yes","Yes","Yes",null,null,"Water","ML (water)",null,null,null,null,null,null,null,null,1,1000,1000000,null,null,null,null,null,null,null,null,"F2","Charcoal","F2-Charcoal","GJ",6.3,6.3E-3,null,3.1099999999999999E-2,null,null,null,null,0,5.3,1,0,5.3E-3,1E-3,null,"NatHERS (whole apartment building average)",null,null,9,34,null,null,null,null,null,11,"Segment Level","cellref",{"$f":"MATCH(CP12,'Electricity Use'!$B$14:$N$14,0)","v":4}]
[null,null,null,null,null,null,null,null,null,null,null,null,null,null,null,null,null,null,null,null,null,null,null,null,null,null,null,null,null,null,null,"E2","Total energy usage from electricity","","Total Energy Use","Yes","Yes","Yes","Yes","Yes",null,null,"Water","kL (water)",null,null,null,null,null,null,null,null,1E-3,1,1000,null,null,null,null,null,null,null,null,"F2","Fuel oil","F2-Fuel oil","GJ",73.84,7.3840000000000003E-2,{"$f":"BU13/1000","v":3.9699999999999999E-2},null,null,39.699999999999996,null,null,73.599999999999994,0.04,0.2,7.3599999999999999E-2,4.0000000000000003E-5,2.0000000000000001E-4,null,"ISCA - Infrastructure Sustainability rating",null,null,10,35,null,null,null,null,null,12,"Description","cellref",{"$f":"MATCH(CP13,'Electricity Use'!$B$14:$N$14,0)","v":7}]
[null,null,null,null,null,null,null,null,null,null,null,null,null,null,null,null,null,null,null,null,null,null,null,null,null,null,null,null,null,null,null,"E3","Total energy usage segmented by renewable and non-renewable sources","","Total Energy Use","Yes","Yes","Yes","Yes","Yes",null,null,"Water","L (water)",null,null,null,null,null,null,null,null,9.9999999999999995E-7,1E-3,1,null,null,null,null,null,null,null,null,"T3","Petrol (Unleaded/Premium)","T3-Petrol (Unleaded/Premium)","GJ",67.62,6.762E-2,3.4200000000000001E-2,null,null,34.200000000000003,null,null,67.400000000000006,0.02,0.2,6.7400000000000002E-2,2.0000000000000002E-5,2.0000000000000001E-4,null,null,null,null,null,36,null,null,null,null,null,13,"Flag","cellref",{"$f":"MATCH(CP14,'Electricity Use'!$B$14:$N$14,0)","v":8}]
[null,null,null,null,null,null,null,null,null,null,null,null,null,null,null,null,null,null,null,null,null,null,null,null,null,null,null,null,null,null,null,"E4","Units of energy used normalised","","Total Energy Use","Yes","Yes","Yes","Yes","Yes",null,null,"Distance","Km",null,null,null,null,null,null,null,null,null,null,null,1,1000,0.62137273664980675,null,null,null,null,null,"T3","Petrol (E10)","T3-Petrol (E10)","GJ",60.898000000000003,6.0898000000000001E-2,3.3120000000000004E-2,null,null,{"$f":"N(\"Ethanol\")+0.1*23.4+N(\"Petrol\")+0.9*BU14","v":33.120000000000005},null,null,{"$f":"N(\"Ethanol\")+0*0.1+N(\"Petrol\")+BX14*0.9","v":60.660000000000004},{"$f":"N(\"Ethanol\")+0.2*0.1+N(\"Petrol\")+BY14*0.9","v":3.8000000000000006E-2},{"$f":"N(\"Ethanol\")+0.2*0.1+N(\"Petrol\")+BZ14*0.9","v":0.2},6.0660000000000006E-2,3.8000000000000009E-5,2.0000000000000001E-4,null,null,null,null,null,37,null,null,null,null,null,14,"Final Value","cellref",{"$f":"MATCH(CP15,'Electricity Use'!$B$14:$N$14,0)","v":9}]
[null,null,null,null,null,null,null,null,null,null,null,null,null,null,null,null,null,null,null,null,null,null,null,null,null,null,null,null,null,null,null,"B3","NABERS Energy (National Australian Built Environment Rating system) ratings of newly completed/occupied Entity-owned office buildings and substantial tenancy fit-outs (itemised)","","Sust.Buildings & Infrastructure","Yes","Yes","Yes","Yes",null,"Yes",null,"Distance","m",null,null,null,null,null,null,null,null,null,null,null,1E-3,1,6.2137273664980683E-4,null,null,null,null,null,"T3","Diesel","T3-Diesel","GJ",70.410000000000011,7.0410000000000014E-2,3.8600000000000002E-2,null,null,38.6,null,null,69.900000000000006,0.01,0.5,6.9900000000000004E-2,1.0000000000000001E-5,5.0000000000000001E-4,null,null,null,null,null,38,null,null,null,null,null,15,"Final Unit","cellref",{"$f":"MATCH(CP16,'Electricity Use'!$B$14:$N$14,0)","v":10}]
[null,null,null,null,null,null,null,null,null,null,null,null,null,null,null,null,null,null,null,null,null,null,null,null,null,null,null,null,null,null,null,"B4","Environmental performance ratings (eg. NABERS, Green Star, or ISCAIS rating scheme) of newly completed Entity-owned non-office building or infrastructure projects or upgrades with a value over $1 million","","Sust.Buildings & Infrastructure","Yes","Yes","Yes","Yes","Yes",null,null,"Distance","Miles",null,null,null,null,null,null,null,null,null,null,null,1.60934,1609.34,1,null,null,null,null,null,"T3","Biodiesel","T3-Biodiesel","GJ","DIRECT","DIRECT",3.4599999999999999E-2,null,null,34.6,null,null,"DIRECT","DIRECT","DIRECT","DIRECT","DIRECT","DIRECT",null,null,null,null,null,39,null,null,null,null,null,16,"Input Type","cellref",{"$f":"MATCH(CP17,'Electricity Use'!$B$14:$N$14,0)","v":11}]
[null,null,null,null,null,null,null,null,null,null,null,null,null,null,null,null,null,null,null,null,null,null,null,null,null,null,null,null,null,null,null,"B5","Environmental performance ratings achieved for Entity-owned assets portfolio segmented by rating scheme and building, facility, or infrastructure type, where these ratings have been conducted","","Sust.Buildings & Infrastructure","Yes","Yes",null,null,"Yes",null,null,"Power","MW",null,null,null,null,null,null,null,null,null,null,null,null,null,null,1,1000,null,null,null,"T3","LPG",{"$f":"BL18& \"-\"&BM18","v":"T3-LPG"},"GJ",61,{"$f":"BP18/1000","v":6.0999999999999999E-2},2.6200000000000005E-2,null,null,26.200000000000003,null,null,60.2,0.5,0.3,6.0200000000000004E-2,{"$f":"BY18/1000","v":5.0000000000000001E-4},{"$f":"BZ18/1000","v":2.9999999999999997E-4},null,null,null,null,null,40,null,null,null,null,null,17,"Input Value","cellref",{"$f":"MATCH(CP18,'Electricity Use'!$B$14:$N$14,0)","v":12}]
[null,null,null,null,null,null,null,null,null,null,null,null,null,null,null,null,null,null,null,null,null,null,null,null,null,null,null,null,null,null,null,"W1","Total units of metered water consumed by water source","","Water Use","Yes","Yes","Yes",null,null,null,null,"Power","KW",null,null,null,null,null,null,null,null,null,null,null,null,null,null,1E-3,1,null,null,null,"T3","Avgas","T3-Avgas","GJ",67.66,{"$f":"BP19/1000","v":6.7659999999999998E-2},3.3099999999999997E-2,null,null,33.099999999999994,null,null,67,0.06,0.6,{"$f":"BX19/1000","v":6.7000000000000004E-2},{"$f":"BY19/1000","v":5.9999999999999995E-5},{"$f":"BZ19/1000","v":5.9999999999999995E-4},null,null,null,null,null,41,null,null,null,null,null,18,"Input Unit","cellref",{"$f":"MATCH(CP19,'Electricity Use'!$B$14:$N$14,0)","v":13}]
[null,null,null,null,null,null,null,null,null,null,null,null,null,null,null,null,null,null,null,null,null,null,null,null,null,null,null,null,null,null,null,"W2","Units of metered water consumed normalised by FTE, headcount, floor area, or other entity or sector specific quantity","","Water Use","Yes","Yes","Yes",null,null,null,null,"emissions","Tonnes CO2-e",null,null,null,null,null,null,null,null,null,null,null,null,null,null,null,null,1,1000,null,"T3","Aviation turbine fuel (ATF)","T3-Aviation turbine fuel (ATF)","GJ",70.209999999999994,{"$f":"BP20/1000","v":7.0209999999999995E-2},3.6799999999999999E-2,null,null,36.799999999999997,null,null,69.599999999999994,0.01,0.6,6.9599999999999995E-2,1.0000000000000001E-5,5.9999999999999995E-4,null,null,null,null,null,42]
[null,null,null,null,null,null,null,null,null,null,null,null,null,null,null,null,null,null,null,null,null,null,null,null,null,null,null,null,null,null,null,"WR1","Total units of waste disposed of by waste stream and disposal method (kg and %)","","Waste and Recycling","Yes","Yes","Yes",null,null,null,null,"emissions","KG CO2-e",null,null,null,null,null,null,null,null,null,null,null,null,null,null,null,null,1E-3,1,null,"T3","Hydrogen","T3-Hydrogen","MJ","DIRECT","DIRECT",null,120,null,null,null,null,"DIRECT","DIRECT","DIRECT","DIRECT","DIRECT","DIRECT",null,null,null,null,null,43]
[null,null,null,null,null,null,null,null,null,null,null,null,null,null,null,null,null,null,null,null,null,null,null,null,null,null,null,null,null,null,null,"WR2","Percentage of office sites covered by dedicated collection services for each waste stream","","Waste and Recycling","Yes","Yes",null,null,null,null,null,null,null,null,null,null,null,null,null,null,null,null,null,null,null,null,null,null,null,null,null,null,"T3","Electricity","T3-Electricity","KWh",0.85,{"$f":"BP22/1000","v":8.4999999999999995E-4},null,null,null,null,null,null,"NA","NA","NA","NA","NA","NA",null,null,null,null,null,44]
[null,null,null,null,null,null,null,null,null,null,null,null,null,null,null,null,null,null,null,null,null,null,null,null,null,null,null,null,null,null,null,"WR3","Total units of waste disposed normalised by FTE, headcount, floor area, or other entity or sector specific quantity, by disposal method","","Waste and Recycling","Yes","Yes","Yes",null,null,null,null,null,null,null,null,null,null,null,null,null,null,null,null,null,null,null,null,null,null,null,null,null,"T3","Plug-in Hybrids","T3-Plug-in Hybrids","KWh",0.85,{"$f":"BP23/1000","v":8.4999999999999995E-4},null,null,null,null,null,null,"NA","NA","NA","NA","NA","NA",null,null,null,null,null,45]
[null,null,null,null,null,null,null,null,null,null,null,null,null,null,null,null,null,null,null,null,null,null,null,null,null,null,null,null,null,null,null,"WR4","Recycling rate (% of total waste by weight)","","Waste and Recycling","Yes","Yes","Yes",null,null,null,null,null,null,null,null,null,null,null,null,null,null,null,null,null,null,null,null,null,null,null,null,null,"WR5","Landfill",{"$f":"BL24& \"-\"&BM24","v":"WR5-Landfill"},"Tonnes",1300,{"$f":"BP24/1000","v":1.3},null,null,null,null,null,null,null,null,null,null,null,null,null,null,null,null,null,46]
[null,null,null,null,null,null,null,null,null,null,null,null,null,null,null,null,null,null,null,null,null,null,null,null,null,null,null,null,null,null,null,"WR5","Greenhouse gas emissions associated with waste disposal (tonnes CO2-e)","","Waste and Recycling","Yes","Yes","Yes",null,null,null,null,null,null,null,null,null,null,null,null,null,null,null,null,null,null,null,null,null,null,null,null,null,"G1","Desflurane","G1-Desflurane","KG","DIRECT","DIRECT",null,null,null,null,null,null,null,null,null,null,null,null,null,null,null,null,null,47]
[null,null,null,null,null,null,null,null,null,null,null,null,null,null,null,null,null,null,null,null,null,null,null,null,null,null,null,null,null,null,null,"G1","Total scope one (direct) greenhouse gas emissions (tonnes CO2e)","","Greenhouse Gas Emissions","Yes","Yes","Yes","Yes","Yes",null,null,null,null,null,null,null,null,null,null,null,null,null,null,null,null,null,null,null,null,null,null,null,"G1","Isoflurane","G1-Isoflurane","KG","DIRECT","DIRECT",null,null,null,null,null,null,null,null,null,null,null,null,null,null,null,null,null,48]
[null,null,null,null,null,null,null,null,null,null,null,null,null,null,null,null,null,null,null,null,null,null,null,null,null,null,null,null,null,null,null,"G2","Total scope two (indirect electricity) greenhouse gas emissions (tonnes CO2e)","","Greenhouse Gas Emissions","Yes","Yes","Yes","Yes","Yes",null,null,null,null,null,null,null,null,null,null,null,null,null,null,null,null,null,null,null,null,null,null,null,"G1","Sevoflurane","G1-Sevoflurane","KG","DIRECT","DIRECT",null,null,null,null,null,null,null,null,null,null,null,null,null,null,null,null,null,49]
[null,null,null,null,null,null,null,null,null,null,null,null,null,null,null,null,null,null,null,null,null,null,null,null,null,null,null,null,null,null,null,"G3","Total scope three (other indirect) greenhouse gas emissions associated with commercial air travel and waste disposal (tonnes CO2e)","","Greenhouse Gas Emissions","Yes","Yes","Yes",null,null,null,null,null,null,null,null,null,null,null,null,null,null,null,null,null,null,null,null,null,null,null,null,null,"G1","Wastewater treatment","G1-Wastewater treatment","KG","DIRECT","DIRECT",null,null,null,null,null,null,null,null,null,null,null,null,null,null,null,null,null,50]
[null,null,null,null,null,null,null,null,null,null,null,null,null,null,null,null,null,null,null,null,null,null,null,null,null,null,null,null,null,null,null,"G4","Optional - Total scope three (other indirect) greenhouse gas emissions associated with activities outside the organisational boundary of the entity (tonnes CO2-e)",null,"Greenhouse Gas Emissions",null,null,null,null,null,null,null,null,null,null,null,null,null,null,null,null,null,null,null,null,null,null,null,null,null,null,null,null,"G1","HFC-23 (refrigeration - total stock volume)","G1-HFC-23 (refrigeration - total stock volume)","KG",{"$f":"BV29*BW29","v":2852},{"$f":"BP29/1000","v":2.8519999999999999},null,null,null,null,12400,0.23,null,null,null,null,null,null,null,null,null,null,null,51]
[null,null,null,null,null,null,null,null,null,null,null,null,null,null,null,null,null,null,null,null,null,null,null,null,null,null,null,null,null,null,null,"G5","Optional - Any other known greenhouse gas emissions associated with other activities (tonnes CO2-e)",null,"Greenhouse Gas Emissions",null,null,null,null,null,null,null,null,null,null,null,null,null,null,null,null,null,null,null,null,null,null,null,null,null,null,null,null,"G1","HFC-32 (refrigeration - total stock volume)","G1-HFC-32 (refrigeration - total stock volume)","KG",{"$f":"BV30*BW30","v":155.71},0.15571000000000002,null,null,null,null,677,0.23,null,null,null,null,null,null,null,null,null,null,null,52]
[null,null,null,null,null,null,null,null,null,null,null,null,null,null,null,null,null,null,null,null,null,null,null,null,null,null,null,null,null,null,null,"G6","Optional - Total greenhouse gas emission offsets purchased and retired segmented by activity type (e.g., natural gas, vehicle fleet, air travel) (tonnes CO2-e)",null,"Greenhouse Gas Emissions",null,null,null,null,null,null,null,null,null,null,null,null,null,null,null,null,null,null,null,null,null,null,null,null,null,null,null,null,"G1","HFC-41 (refrigeration - total stock volume)","G1-HFC-41 (refrigeration - total stock volume)","KG",26.68,2.6679999999999999E-2,null,null,null,null,116,0.23,null,null,null,null,null,null,null,null,null,null,null,53]
[null,null,null,null,null,null,null,null,null,null,null,null,null,null,null,null,null,null,null,null,null,null,null,null,null,null,null,null,null,null,null,"G7","Optional - Net greenhouse gas emissions segmented into scope one (direct), scope two (indirect electricity) and scope three (indirect other) [calculated by total greenhouse gas emissions minus retired offsets] (tonnes CO2-e)",null,"Greenhouse Gas Emissions",null,null,null,null,null,null,null,null,null,null,null,null,null,null,null,null,null,null,null,null,null,null,null,null,null,null,null,null,"G1","HFC-43-10mee (refrigeration - total stock volume)","G1-HFC-43-10mee (refrigeration - total stock volume)","KG",379.5,0.3795,null,null,null,null,1650,0.23,null,null,null,null,null,null,null,null,null,null,null,54]
[null,null,null,null,null,null,null,null,null,null,null,null,null,null,null,null,null,null,null,null,null,null,null,null,null,null,null,null,null,null,null,null,null,null,null,null,null,null,null,null,null,null,null,null,null,null,null,null,null,null,null,null,null,null,null,null,null,null,null,null,null,null,null,"G1","HFC-125 (refrigeration - total stock volume)","G1-HFC-125 (refrigeration - total stock volume)","KG",729.10000000000014,0.72910000000000008,null,null,null,null,3170.0000000000005,0.23,null,null,null,null,null,null,null,null,null,null,null,55]
[null,null,null,null,null,null,null,null,null,null,null,null,null,null,null,null,null,null,null,null,null,null,null,null,null,null,null,null,null,null,null,null,null,null,null,null,null,null,null,null,null,null,null,null,null,null,null,null,null,null,null,null,null,null,null,null,null,null,null,null,null,null,null,"G1","HFC-134 (refrigeration - total stock volume)","G1-HFC-134 (refrigeration - total stock volume)","KG",257.60000000000002,0.2576,null,null,null,null,1120,0.23,null,null,null,null,null,null,null,null,null,null,null,56]
[null,null,null,null,null,null,null,null,null,null,null,null,null,null,null,null,null,null,null,null,null,null,null,null,null,null,null,null,null,null,null,null,null,null,null,null,null,null,null,null,null,null,null,null,null,null,null,null,null,null,null,null,null,null,null,null,null,null,null,null,null,null,null,"G1","HFC-134a (refrigeration - total stock volume)","G1-HFC-134a (refrigeration - total stock volume)","KG",299,0.29899999999999999,null,null,null,null,1300,0.23,null,null,null,null,null,null,null,null,null,null,null,57]
[null,null,null,null,null,null,null,null,null,null,null,null,null,null,null,null,null,null,null,null,null,null,null,null,null,null,null,null,null,null,null,null,null,null,null,null,null,null,null,null,null,null,null,null,null,null,null,null,null,null,null,null,null,null,null,null,null,null,null,null,null,null,null,"G1","HFC-143 (refrigeration - total stock volume)","G1-HFC-143 (refrigeration - total stock volume)","KG",75.44,7.5439999999999993E-2,null,null,null,null,328,0.23,null,null,null,null,null,null,null,null,null,null,null,58]
[null,null,null,null,null,null,null,null,null,null,null,null,null,null,null,null,null,null,null,null,null,null,null,null,null,null,null,null,null,null,null,null,null,null,null,null,null,null,null,null,null,null,null,null,null,null,null,null,null,null,null,null,null,null,null,null,null,null,null,null,null,null,null,"G1","HFC-143a (refrigeration - total stock volume)","G1-HFC-143a (refrigeration - total stock volume)","KG",1104,1.1040000000000001,null,null,null,null,4800,0.23,null,null,null,null,null,null,null,null,null,null,null,59]
[null,null,null,null,null,null,null,null,null,null,null,null,null,null,null,null,null,null,null,null,null,null,null,null,null,null,null,null,null,null,null,null,null,null,null,null,null,null,null,null,null,null,null,null,null,null,null,null,null,null,null,null,null,null,null,null,null,null,null,null,null,null,null,"G1","HFC-152a (refrigeration - total stock volume)","G1-HFC-152a (refrigeration - total stock volume)","KG",31.740000000000002,3.1740000000000004E-2,null,null,null,null,138,0.23,null,null,null,null,null,null,null,null,null,null,null,60]
[null,null,null,null,null,null,null,null,null,null,null,null,null,null,null,null,null,null,null,null,null,null,null,null,null,null,null,null,null,null,null,null,null,null,null,null,null,null,null,null,null,null,null,null,null,null,null,null,null,null,null,null,null,null,null,null,null,null,null,null,null,null,null,"G1","HFC-227ea (refrigeration - total stock volume)","G1-HFC-227ea (refrigeration - total stock volume)","KG",770.5,0.77049999999999996,null,null,null,null,3350,0.23,null,null,null,null,null,null,null,null,null,null,null,61]
[null,null,null,null,null,null,null,null,null,null,null,null,null,null,null,null,null,null,null,null,null,null,null,null,null,null,null,null,null,null,null,null,null,null,null,null,null,null,null,null,null,null,null,null,null,null,null,null,null,null,null,null,null,null,null,null,null,null,null,null,null,null,null,"G1","HFC-236fa (refrigeration - total stock volume)","G1-HFC-236fa (refrigeration - total stock volume)","KG",1853.8000000000002,1.8538000000000001,null,null,null,null,8060,0.23,null,null,null,null,null,null,null,null,null,null,null,62]
[null,null,null,null,null,null,null,null,null,null,null,null,null,null,null,null,null,null,null,null,null,null,null,null,null,null,null,null,null,null,null,null,null,null,null,null,null,null,null,null,null,null,null,null,null,null,null,null,null,null,null,null,null,null,null,null,null,null,null,null,null,null,null,"G1","HFC-245ca (refrigeration - total stock volume)","G1-HFC-245ca (refrigeration - total stock volume)","KG",164.68,0.16467999999999999,null,null,null,null,716,0.23,null,null,null,null,null,null,null,null,null,null,null,63]
[null,null,null,null,null,null,null,null,null,null,null,null,null,null,null,null,null,null,null,null,null,null,null,null,null,null,null,null,null,null,null,null,null,null,null,null,null,null,null,null,null,null,null,null,null,null,null,null,null,null,null,null,null,null,null,null,null,null,null,null,null,null,null,"G1","HFC-245fa (refrigeration - total stock volume)","G1-HFC-245fa (refrigeration - total stock volume)","KG",197.34,0.19734000000000002,null,null,null,null,858,0.23,null,null,null,null,null,null,null,null,null,null,null,64]
[null,null,null,null,null,null,null,null,null,null,null,null,null,null,null,null,null,null,null,null,null,null,null,null,null,null,null,null,null,null,null,null,null,null,null,null,null,null,null,null,null,null,null,null,null,null,null,null,null,null,null,null,null,null,null,null,null,null,null,null,null,null,null,"G1","HFC-365mfc (refrigeration - total stock volume)","G1-HFC-365mfc (refrigeration - total stock volume)","KG",184.92000000000002,0.18492000000000003,null,null,null,null,804,0.23,null,null,null,null,null,null,null,null,null,null,null,65]
[null,null,null,null,null,null,null,null,null,null,null,null,null,null,null,null,null,null,null,null,null,null,null,null,null,null,null,null,null,null,null,null,null,null,null,null,null,null,null,null,null,null,null,null,null,null,null,null,null,null,null,null,null,null,null,null,null,null,null,null,null,null,null,"G1","PFC-14 (refrigeration - total stock volume)",{"$f":"BL44& \"-\"&BM44","v":"G1-PFC-14 (refrigeration - total stock volume)"},"KG",1524.8999999999999,1.5248999999999999,null,null,null,null,6629.9999999999991,0.23,null,null,null,null,null,null,null,null,null,null,null,66]
[null,null,null,null,null,null,null,null,null,null,null,null,null,null,null,null,null,null,null,null,null,null,null,null,null,null,null,null,null,null,null,null,null,null,null,null,null,null,null,null,null,null,null,null,null,null,null,null,null,null,null,null,null,null,null,null,null,null,null,null,null,null,null,"G1","PFC-116 (refrigeration - total stock volume)","G1-PFC-116 (refrigeration - total stock volume)","KG",2553,2.5529999999999999,null,null,null,null,11100,0.23,null,null,null,null,null,null,null,null,null,null,null,67]
[null,null,null,null,null,null,null,null,null,null,null,null,null,null,null,null,null,null,null,null,null,null,null,null,null,null,null,null,null,null,null,null,null,null,null,null,null,null,null,null,null,null,null,null,null,null,null,null,null,null,null,null,null,null,null,null,null,null,null,null,null,null,null,"G1","PFC-218 (refrigeration - total stock volume)","G1-PFC-218 (refrigeration - total stock volume)","KG",2047,2.0470000000000002,null,null,null,null,8900,0.23,null,null,null,null,null,null,null,null,null,null,null,68]
[null,null,null,null,null,null,null,null,null,null,null,null,null,null,null,null,null,null,null,null,null,null,null,null,null,null,null,null,null,null,null,null,null,null,null,null,null,null,null,null,null,null,null,null,null,null,null,null,null,null,null,null,null,null,null,null,null,null,null,null,null,null,null,"G1","PFC-318 (refrigeration - total stock volume)","G1-PFC-318 (refrigeration - total stock volume)","KG",2194.2000000000003,2.1942000000000004,null,null,null,null,9540,0.23,null,null,null,null,null,null,null,null,null,null,null,69]
[null,null,null,null,null,null,null,null,null,null,null,null,null,null,null,null,null,null,null,null,null,null,null,null,null,null,null,null,null,null,null,null,null,null,null,null,null,null,null,null,null,null,null,null,null,null,null,null,null,null,null,null,null,null,null,null,null,null,null,null,null,null,null,"G1","PFC-3-1-10 (refrigeration - total stock volume)","G1-PFC-3-1-10 (refrigeration - total stock volume)","KG",2116,2.1160000000000001,null,null,null,null,9200,0.23,null,null,null,null,null,null,null,null,null,null,null,70]
[null,null,null,null,null,null,null,null,null,null,null,null,null,null,null,null,null,null,null,null,null,null,null,null,null,null,null,null,null,null,null,null,null,null,null,null,null,null,null,null,null,null,null,null,null,null,null,null,null,null,null,null,null,null,null,null,null,null,null,null,null,null,null,"G1","PFC-4-1-12 (refrigeration - total stock volume)","G1-PFC-4-1-12 (refrigeration - total stock volume)","KG",1966.5,1.9664999999999999,null,null,null,null,8550,0.23,null,null,null,null,null,null,null,null,null,null,null,71]
[null,null,null,null,null,null,null,null,null,null,null,null,null,null,null,null,null,null,null,null,null,null,null,null,null,null,null,null,null,null,null,null,null,null,null,null,null,null,null,null,null,null,null,null,null,null,null,null,null,null,null,null,null,null,null,null,null,null,null,null,null,null,null,"G1","PFC-5-1-14 (refrigeration - total stock volume)","G1-PFC-5-1-14 (refrigeration - total stock volume)","KG",1819.3000000000002,1.8193000000000001,null,null,null,null,7910,0.23,null,null,null,null,null,null,null,null,null,null,null,72]
[null,null,null,null,null,null,null,null,null,null,null,null,null,null,null,null,null,null,null,null,null,null,null,null,null,null,null,null,null,null,null,null,null,null,null,null,null,null,null,null,null,null,null,null,null,null,null,null,null,null,null,null,null,null,null,null,null,null,null,null,null,null,null,"G1","PFC-9-1-18 (refrigeration - total stock volume)","G1-PFC-9-1-18 (refrigeration - total stock volume)","KG",1653.7000000000003,1.6537000000000002,null,null,null,null,7190.0000000000009,0.23,null,null,null,null,null,null,null,null,null,null,null,73]
[null,null,null,null,null,null,null,null,null,null,null,null,null,null,null,null,null,null,null,null,null,null,null,null,null,null,null,null,null,null,null,null,null,null,null,null,null,null,null,null,null,null,null,null,null,null,null,null,null,null,null,null,null,null,null,null,null,null,null,null,null,null,null,"G1","HFC-23 (air conditioning - total stock volume)","G1-HFC-23 (air conditioning - total stock volume)","KG",1116,1.1160000000000001,null,null,null,null,12400,0.09,null,null,null,null,null,null,null,null,null,null,null,74]
[null,null,null,null,null,null,null,null,null,null,null,null,null,null,null,null,null,null,null,null,null,null,null,null,null,null,null,null,null,null,null,null,null,null,null,null,null,null,null,null,null,null,null,null,null,null,null,null,null,null,null,null,null,null,null,null,null,null,null,null,null,null,null,"G1","HFC-32 (air conditioning - total stock volume)","G1-HFC-32 (air conditioning - total stock volume)","KG",60.93,6.0929999999999998E-2,null,null,null,null,677,0.09,null,null,null,null,null,null,null,null,null,null,null,75]
[null,null,null,null,null,null,null,null,null,null,null,null,null,null,null,null,null,null,null,null,null,null,null,null,null,null,null,null,null,null,null,null,null,null,null,null,null,null,null,null,null,null,null,null,null,null,null,null,null,null,null,null,null,null,null,null,null,null,null,null,null,null,null,"G1","HFC-41 (air conditioning - total stock volume)","G1-HFC-41 (air conditioning - total stock volume)","KG",10.44,1.044E-2,null,null,null,null,116,0.09,null,null,null,null,null,null,null,null,null,null,null,76]
[null,null,null,null,null,null,null,null,null,null,null,null,null,null,null,null,null,null,null,null,null,null,null,null,null,null,null,null,null,null,null,null,null,null,null,null,null,null,null,null,null,null,null,null,null,null,null,null,null,null,null,null,null,null,null,null,null,null,null,null,null,null,null,"G1","HFC-43-10mee (air conditioning - total stock volume)","G1-HFC-43-10mee (air conditioning - total stock volume)","KG",148.5,0.14849999999999999,null,null,null,null,1650,0.09,null,null,null,null,null,null,null,null,null,null,null,77]
[null,null,null,null,null,null,null,null,null,null,null,null,null,null,null,null,null,null,null,null,null,null,null,null,null,null,null,null,null,null,null,null,null,null,null,null,null,null,null,null,null,null,null,null,null,null,null,null,null,null,null,null,null,null,null,null,null,null,null,null,null,null,null,"G1","HFC-125 (air conditioning - total stock volume)","G1-HFC-125 (air conditioning - total stock volume)","KG",285.3,0.2853,null,null,null,null,3170.0000000000005,0.09,null,null,null,null,null,null,null,null,null,null,null,78]
[null,null,null,null,null,null,null,null,null,null,null,null,null,null,null,null,null,null,null,null,null,null,null,null,null,null,null,null,null,null,null,null,null,null,null,null,null,null,null,null,null,null,null,null,null,null,null,null,null,null,null,null,null,null,null,null,null,null,null,null,null,null,null,"G1","HFC-134 (air conditioning - total stock volume)","G1-HFC-134 (air conditioning - total stock volume)","KG",100.8,0.1008,null,null,null,null,1120,0.09,null,null,null,null,null,null,null,null,null,null,null,79]
[null,null,null,null,null,null,null,null,null,null,null,null,null,null,null,null,null,null,null,null,null,null,null,null,null,null,null,null,null,null,null,null,null,null,null,null,null,null,null,null,null,null,null,null,null,null,null,null,null,null,null,null,null,null,null,null,null,null,null,null,null,null,null,"G1","HFC-134a (air conditioning - total stock volume)","G1-HFC-134a (air conditioning - total stock volume)","KG",117,0.11700000000000001,null,null,null,null,1300,0.09,null,null,null,null,null,null,null,null,null,null,null,80]
[null,null,null,null,null,null,null,null,null,null,null,null,null,null,null,null,null,null,null,null,null,null,null,null,null,null,null,null,null,null,null,null,null,null,null,null,null,null,null,null,null,null,null,null,null,null,null,null,null,null,null,null,null,null,null,null,null,null,null,null,null,null,null,"G1","HFC-143 (air conditioning - total stock volume)","G1-HFC-143 (air conditioning - total stock volume)","KG",29.52,2.9520000000000001E-2,null,null,null,null,328,0.09,null,null,null,null,null,null,null,null,null,null,null,81]
[null,null,null,null,null,null,null,null,null,null,null,null,null,null,null,null,null,null,null,null,null,null,null,null,null,null,null,null,null,null,null,null,null,null,null,null,null,null,null,null,null,null,null,null,null,null,null,null,null,null,null,null,null,null,null,null,null,null,null,null,null,null,null,"G1","HFC-143a (air conditioning - total stock volume)","G1-HFC-143a (air conditioning - total stock volume)","KG",432,0.432,null,null,null,null,4800,0.09,null,null,null,null,null,null,null,null,null,null,null,82]
[null,null,null,null,null,null,null,null,null,null,null,null,null,null,null,null,null,null,null,null,null,null,null,null,null,null,null,null,null,null,null,null,null,null,null,null,null,null,null,null,null,null,null,null,null,null,null,null,null,null,null,null,null,null,null,null,null,null,null,null,null,null,null,"G1","HFC-152a (air conditioning - total stock volume)","G1-HFC-152a (air conditioning - total stock volume)","KG",12.42,1.242E-2,null,null,null,null,138,0.09,null,null,null,null,null,null,null,null,null,null,null,83]
[null,null,null,null,null,null,null,null,null,null,null,null,null,null,null,null,null,null,null,null,null,null,null,null,null,null,null,null,null,null,null,null,null,null,null,null,null,null,null,null,null,null,null,null,null,null,null,null,null,null,null,null,null,null,null,null,null,null,null,null,null,null,null,"G1","HFC-227ea (air conditioning - total stock volume)",{"$f":"BL62& \"-\"&BM62","v":"G1-HFC-227ea (air conditioning - total stock volume)"},"KG",{"$f":"BV62*BW62","v":301.5},0.30149999999999999,null,null,null,null,3350,0.09,null,null,null,null,null,null,null,null,null,null,null,84]
[null,null,null,null,null,null,null,null,null,null,null,null,null,null,null,null,null,null,null,null,null,null,null,null,null,null,null,null,null,null,null,null,null,null,null,null,null,null,null,null,null,null,null,null,null,null,null,null,null,null,null,null,null,null,null,null,null,null,null,null,null,null,null,"G1","HFC-236fa (air conditioning - total stock volume)","G1-HFC-236fa (air conditioning - total stock volume)","KG",725.4,0.72539999999999993,null,null,null,null,8060,0.09,null,null,null,null,null,null,null,null,null,null,null,85]
[null,null,null,null,null,null,null,null,null,null,null,null,null,null,null,null,null,null,null,null,null,null,null,null,null,null,null,null,null,null,null,null,null,null,null,null,null,null,null,null,null,null,null,null,null,null,null,null,null,null,null,null,null,null,null,null,null,null,null,null,null,null,null,"G1","HFC-245ca (air conditioning - total stock volume)","G1-HFC-245ca (air conditioning - total stock volume)","KG",64.44,6.4439999999999997E-2,null,null,null,null,716,0.09,null,null,null,null,null,null,null,null,null,null,null,86]
[null,null,null,null,null,null,null,null,null,null,null,null,null,null,null,null,null,null,null,null,null,null,null,null,null,null,null,null,null,null,null,null,null,null,null,null,null,null,null,null,null,null,null,null,null,null,null,null,null,null,null,null,null,null,null,null,null,null,null,null,null,null,null,"G1","HFC-245fa (air conditioning - total stock volume)","G1-HFC-245fa (air conditioning - total stock volume)","KG",77.22,7.7219999999999997E-2,null,null,null,null,858,0.09,null,null,null,null,null,null,null,null,null,null,null,87]
[null,null,null,null,null,null,null,null,null,null,null,null,null,null,null,null,null,null,null,null,null,null,null,null,null,null,null,null,null,null,null,null,null,null,null,null,null,null,null,null,null,null,null,null,null,null,null,null,null,null,null,null,null,null,null,null,null,null,null,null,null,null,null,"G1","HFC-365mfc (air conditioning - total stock volume)","G1-HFC-365mfc (air conditioning - total stock volume)","KG",72.36,7.2359999999999994E-2,null,null,null,null,804,0.09,null,null,null,null,null,null,null,null,null,null,null,88]
[null,null,null,null,null,null,null,null,null,null,null,null,null,null,null,null,null,null,null,null,null,null,null,null,null,null,null,null,null,null,null,null,null,null,null,null,null,null,null,null,null,null,null,null,null,null,null,null,null,null,null,null,null,null,null,null,null,null,null,null,null,null,null,"G1","PFC-14 (air conditioning - total stock volume)","G1-PFC-14 (air conditioning - total stock volume)","KG",596.69999999999993,0.5966999999999999,null,null,null,null,6629.9999999999991,0.09,null,null,null,null,null,null,null,null,null,null,null,89]
[null,null,null,null,null,null,null,null,null,null,null,null,null,null,null,null,null,null,null,null,null,null,null,null,null,null,null,null,null,null,null,null,null,null,null,null,null,null,null,null,null,null,null,null,null,null,null,null,null,null,null,null,null,null,null,null,null,null,null,null,null,null,null,"G1","PFC-116 (air conditioning - total stock volume)","G1-PFC-116 (air conditioning - total stock volume)","KG",999,0.999,null,null,null,null,11100,0.09,null,null,null,null,null,null,null,null,null,null,null,90]
[null,null,null,null,null,null,null,null,null,null,null,null,null,null,null,null,null,null,null,null,null,null,null,null,null,null,null,null,null,null,null,null,null,null,null,null,null,null,null,null,null,null,null,null,null,null,null,null,null,null,null,null,null,null,null,null,null,null,null,null,null,null,null,"G1","PFC-218 (air conditioning - total stock volume)","G1-PFC-218 (air conditioning - total stock volume)","KG",801,0.80100000000000005,null,null,null,null,8900,0.09,null,null,null,null,null,null,null,null,null,null,null,91]
[null,null,null,null,null,null,null,null,null,null,null,null,null,null,null,null,null,null,null,null,null,null,null,null,null,null,null,null,null,null,null,null,null,null,null,null,null,null,null,null,null,null,null,null,null,null,null,null,null,null,null,null,null,null,null,null,null,null,null,null,null,null,null,"G1","PFC-318 (air conditioning - total stock volume)","G1-PFC-318 (air conditioning - total stock volume)","KG",858.6,0.85860000000000003,null,null,null,null,9540,0.09,null,null,null,null,null,null,null,null,null,null,null,92]
[null,null,null,null,null,null,null,null,null,null,null,null,null,null,null,null,null,null,null,null,null,null,null,null,null,null,null,null,null,null,null,null,null,null,null,null,null,null,null,null,null,null,null,null,null,null,null,null,null,null,null,null,null,null,null,null,null,null,null,null,null,null,null,"G1","PFC-3-1-10 (air conditioning - total stock volume)","G1-PFC-3-1-10 (air conditioning - total stock volume)","KG",828,0.82799999999999996,null,null,null,null,9200,0.09,null,null,null,null,null,null,null,null,null,null,null,93]
[null,null,null,null,null,null,null,null,null,null,null,null,null,null,null,null,null,null,null,null,null,null,null,null,null,null,null,null,null,null,null,null,null,null,null,null,null,null,null,null,null,null,null,null,null,null,null,null,null,null,null,null,null,null,null,null,null,null,null,null,null,null,null,"G1","PFC-4-1-12 (air conditioning - total stock volume)","G1-PFC-4-1-12 (air conditioning - total stock volume)","KG",769.5,0.76949999999999996,null,null,null,null,8550,0.09,null,null,null,null,null,null,null,null,null,null,null,94]
[null,null,null,null,null,null,null,null,null,null,null,null,null,null,null,null,null,null,null,null,null,null,null,null,null,null,null,null,null,null,null,null,null,null,null,null,null,null,null,null,null,null,null,null,null,null,null,null,null,null,null,null,null,null,null,null,null,null,null,null,null,null,null,"G1","PFC-5-1-14 (air conditioning - total stock volume)","G1-PFC-5-1-14 (air conditioning - total stock volume)","KG",711.9,0.71189999999999998,null,null,null,null,7910,0.09,null,null,null,null,null,null,null,null,null,null,null,95]
[null,null,null,null,null,null,null,null,null,null,null,null,null,null,null,null,null,null,null,null,null,null,null,null,null,null,null,null,null,null,null,null,null,null,null,null,null,null,null,null,null,null,null,null,null,null,null,null,null,null,null,null,null,null,null,null,null,null,null,null,null,null,null,"G1","PFC-9-1-18 (air conditioning - total stock volume)","G1-PFC-9-1-18 (air conditioning - total stock volume)","KG",647.1,0.64710000000000001,null,null,null,null,7190.0000000000009,0.09,null,null,null,null,null,null,null,null,null,null,null,96]
[null,null,null,null,null,null,null,null,null,null,null,null,null,null,null,null,null,null,null,null,null,null,null,null,null,null,null,null,null,null,null,null,null,null,null,null,null,null,null,null,null,null,null,null,null,null,null,null,null,null,null,null,null,null,null,null,null,null,null,null,null,null,null,"G1","CO2 (fire suppression fixed - total stock volume)",{"$f":"BL75& \"-\"&BM75","v":"G1-CO2 (fire suppression fixed - total stock volume)"},"KG",{"$f":"BV75*BW75","v":2.5000000000000001E-2},{"$f":"BP75/1000","v":2.5000000000000001E-5},null,null,null,null,1,2.5000000000000001E-2,null,null,null,null,null,null,null,null,null,null,null,97]
[null,null,null,null,null,null,null,null,null,null,null,null,null,null,null,null,null,null,null,null,null,null,null,null,null,null,null,null,null,null,null,null,null,null,null,null,null,null,null,null,null,null,null,null,null,null,null,null,null,null,null,null,null,null,null,null,null,null,null,null,null,null,null,"G1","HFC-23 (fire suppression fixed - total stock volume)","G1-HFC-23 (fire suppression fixed - total stock volume)","KG",{"$f":"BV76*BW76","v":310},0.31,null,null,null,null,12400,2.5000000000000001E-2,null,null,null,null,null,null,null,null,null,null,null,98]
[null,null,null,null,null,null,null,null,null,null,null,null,null,null,null,null,null,null,null,null,null,null,null,null,null,null,null,null,null,null,null,null,null,null,null,null,null,null,null,null,null,null,null,null,null,null,null,null,null,null,null,null,null,null,null,null,null,null,null,null,null,null,null,"G1","HFC-32 (fire suppression fixed - total stock volume)","G1-HFC-32 (fire suppression fixed - total stock volume)","KG",{"$f":"BV77*BW77","v":16.925000000000001},1.6924999999999999E-2,null,null,null,null,677,2.5000000000000001E-2,null,null,null,null,null,null,null,null,null,null,null,99]
[null,null,null,null,null,null,null,null,null,null,null,null,null,null,null,null,null,null,null,null,null,null,null,null,null,null,null,null,null,null,null,null,null,null,null,null,null,null,null,null,null,null,null,null,null,null,null,null,null,null,null,null,null,null,null,null,null,null,null,null,null,null,null,"G1","HFC-41 (fire suppression fixed - total stock volume)","G1-HFC-41 (fire suppression fixed - total stock volume)","KG",2.9000000000000004,2.9000000000000002E-3,null,null,null,null,116,2.5000000000000001E-2,null,null,null,null,null,null,null,null,null,null,null,100]
[null,null,null,null,null,null,null,null,null,null,null,null,null,null,null,null,null,null,null,null,null,null,null,null,null,null,null,null,null,null,null,null,null,null,null,null,null,null,null,null,null,null,null,null,null,null,null,null,null,null,null,null,null,null,null,null,null,null,null,null,null,null,null,"G1","HFC-43-10mee (fire suppression fixed - total stock volume)","G1-HFC-43-10mee (fire suppression fixed - total stock volume)","KG",41.25,4.1250000000000002E-2,null,null,null,null,1650,2.5000000000000001E-2]
[null,null,null,null,null,null,null,null,null,null,null,null,null,null,null,null,null,null,null,null,null,null,null,null,null,null,null,null,null,null,null,null,null,null,null,null,null,null,null,null,null,null,null,null,null,null,null,null,null,null,null,null,null,null,null,null,null,null,null,null,null,null,null,"G1","HFC-125 (fire suppression fixed - total stock volume)","G1-HFC-125 (fire suppression fixed - total stock volume)","KG",79.250000000000014,7.9250000000000015E-2,null,null,null,null,3170.0000000000005,2.5000000000000001E-2]
[null,null,null,null,null,null,null,null,null,null,null,null,null,null,null,null,null,null,null,null,null,null,null,null,null,null,null,null,null,null,null,null,null,null,null,null,null,null,null,null,null,null,null,null,null,null,null,null,null,null,null,null,null,null,null,null,null,null,null,null,null,null,null,"G1","HFC-134 (fire suppression fixed - total stock volume)","G1-HFC-134 (fire suppression fixed - total stock volume)","KG",28,2.8000000000000001E-2,null,null,null,null,1120,2.5000000000000001E-2]
[null,null,null,null,null,null,null,null,null,null,null,null,null,null,null,null,null,null,null,null,null,null,null,null,null,null,null,null,null,null,null,null,null,null,null,null,null,null,null,null,null,null,null,null,null,null,null,null,null,null,null,null,null,null,null,null,null,null,null,null,null,null,null,"G1","HFC-134a (fire suppression fixed - total stock volume)","G1-HFC-134a (fire suppression fixed - total stock volume)","KG",32.5,3.2500000000000001E-2,null,null,null,null,1300,2.5000000000000001E-2]
[null,null,null,null,null,null,null,null,null,null,null,null,null,null,null,null,null,null,null,null,null,null,null,null,null,null,null,null,null,null,null,null,null,null,null,null,null,null,null,null,null,null,null,null,null,null,null,null,null,null,null,null,null,null,null,null,null,null,null,null,null,null,null,"G1","HFC-143 (fire suppression fixed - total stock volume)","G1-HFC-143 (fire suppression fixed - total stock volume)","KG",8.2000000000000011,8.2000000000000007E-3,null,null,null,null,328,2.5000000000000001E-2]
[null,null,null,null,null,null,null,null,null,null,null,null,null,null,null,null,null,null,null,null,null,null,null,null,null,null,null,null,null,null,null,null,null,null,null,null,null,null,null,null,null,null,null,null,null,null,null,null,null,null,null,null,null,null,null,null,null,null,null,null,null,null,null,"G1","HFC-143a (fire suppression fixed - total stock volume)","G1-HFC-143a (fire suppression fixed - total stock volume)","KG",120,0.12,null,null,null,null,4800,2.5000000000000001E-2]
[null,null,null,null,null,null,null,null,null,null,null,null,null,null,null,null,null,null,null,null,null,null,null,null,null,null,null,null,null,null,null,null,null,null,null,null,null,null,null,null,null,null,null,null,null,null,null,null,null,null,null,null,null,null,null,null,null,null,null,null,null,null,null,"G1","HFC-152a (fire suppression fixed - total stock volume)","G1-HFC-152a (fire suppression fixed - total stock volume)","KG",3.45,3.4500000000000004E-3,null,null,null,null,138,2.5000000000000001E-2]
[null,null,null,null,null,null,null,null,null,null,null,null,null,null,null,null,null,null,null,null,null,null,null,null,null,null,null,null,null,null,null,null,null,null,null,null,null,null,null,null,null,null,null,null,null,null,null,null,null,null,null,null,null,null,null,null,null,null,null,null,null,null,null,"G1","HFC-227ea (fire suppression fixed - total stock volume)","G1-HFC-227ea (fire suppression fixed - total stock volume)","KG",83.75,8.3750000000000005E-2,null,null,null,null,3350,2.5000000000000001E-2]
[null,null,null,null,null,null,null,null,null,null,null,null,null,null,null,null,null,null,null,null,null,null,null,null,null,null,null,null,null,null,null,null,null,null,null,null,null,null,null,null,null,null,null,null,null,null,null,null,null,null,null,null,null,null,null,null,null,null,null,null,null,null,null,"G1","HFC-236fa (fire suppression fixed - total stock volume)","G1-HFC-236fa (fire suppression fixed - total stock volume)","KG",201.5,0.20150000000000001,null,null,null,null,8060,2.5000000000000001E-2]
[null,null,null,null,null,null,null,null,null,null,null,null,null,null,null,null,null,null,null,null,null,null,null,null,null,null,null,null,null,null,null,null,null,null,null,null,null,null,null,null,null,null,null,null,null,null,null,null,null,null,null,null,null,null,null,null,null,null,null,null,null,null,null,"G1","HFC-245ca (fire suppression fixed - total stock volume)","G1-HFC-245ca (fire suppression fixed - total stock volume)","KG",17.900000000000002,1.7900000000000003E-2,null,null,null,null,716,2.5000000000000001E-2]
[null,null,null,null,null,null,null,null,null,null,null,null,null,null,null,null,null,null,null,null,null,null,null,null,null,null,null,null,null,null,null,null,null,null,null,null,null,null,null,null,null,null,null,null,null,null,null,null,null,null,null,null,null,null,null,null,null,null,null,null,null,null,null,"G1","HFC-245fa (fire suppression fixed - total stock volume)","G1-HFC-245fa (fire suppression fixed - total stock volume)","KG",21.450000000000003,2.1450000000000004E-2,null,null,null,null,858,2.5000000000000001E-2]
[null,null,null,null,null,null,null,null,null,null,null,null,null,null,null,null,null,null,null,null,null,null,null,null,null,null,null,null,null,null,null,null,null,null,null,null,null,null,null,null,null,null,null,null,null,null,null,null,null,null,null,null,null,null,null,null,null,null,null,null,null,null,null,"G1","HFC-365mfc (fire suppression fixed - total stock volume)","G1-HFC-365mfc (fire suppression fixed - total stock volume)","KG",20.100000000000001,2.01E-2,null,null,null,null,804,2.5000000000000001E-2]
[null,null,null,null,null,null,null,null,null,null,null,null,null,null,null,null,null,null,null,null,null,null,null,null,null,null,null,null,null,null,null,null,null,null,null,null,null,null,null,null,null,null,null,null,null,null,null,null,null,null,null,null,null,null,null,null,null,null,null,null,null,null,null,"G1","PFC-14 (fire suppression fixed - total stock volume)","G1-PFC-14 (fire suppression fixed - total stock volume)","KG",165.75,0.16575000000000001,null,null,null,null,6629.9999999999991,2.5000000000000001E-2]
[null,null,null,null,null,null,null,null,null,null,null,null,null,null,null,null,null,null,null,null,null,null,null,null,null,null,null,null,null,null,null,null,null,null,null,null,null,null,null,null,null,null,null,null,null,null,null,null,null,null,null,null,null,null,null,null,null,null,null,null,null,null,null,"G1","PFC-116 (fire suppression fixed - total stock volume)","G1-PFC-116 (fire suppression fixed - total stock volume)","KG",277.5,0.27750000000000002,null,null,null,null,11100,2.5000000000000001E-2]
[null,null,null,null,null,null,null,null,null,null,null,null,null,null,null,null,null,null,null,null,null,null,null,null,null,null,null,null,null,null,null,null,null,null,null,null,null,null,null,null,null,null,null,null,null,null,null,null,null,null,null,null,null,null,null,null,null,null,null,null,null,null,null,"G1","PFC-218 (fire suppression fixed - total stock volume)","G1-PFC-218 (fire suppression fixed - total stock volume)","KG",222.5,0.2225,null,null,null,null,8900,2.5000000000000001E-2]
[null,null,null,null,null,null,null,null,null,null,null,null,null,null,null,null,null,null,null,null,null,null,null,null,null,null,null,null,null,null,null,null,null,null,null,null,null,null,null,null,null,null,null,null,null,null,null,null,null,null,null,null,null,null,null,null,null,null,null,null,null,null,null,"G1","PFC-318 (fire suppression fixed - total stock volume)","G1-PFC-318 (fire suppression fixed - total stock volume)","KG",238.5,0.23849999999999999,null,null,null,null,9540,2.5000000000000001E-2]
[null,null,null,null,null,null,null,null,null,null,null,null,null,null,null,null,null,null,null,null,null,null,null,null,null,null,null,null,null,null,null,null,null,null,null,null,null,null,null,null,null,null,null,null,null,null,null,null,null,null,null,null,null,null,null,null,null,null,null,null,null,null,null,"G1","PFC-3-1-10 (fire suppression fixed - total stock volume)","G1-PFC-3-1-10 (fire suppression fixed - total stock volume)","KG",230,0.23,null,null,null,null,9200,2.5000000000000001E-2]
[null,null,null,null,null,null,null,null,null,null,null,null,null,null,null,null,null,null,null,null,null,null,null,null,null,null,null,null,null,null,null,null,null,null,null,null,null,null,null,null,null,null,null,null,null,null,null,null,null,null,null,null,null,null,null,null,null,null,null,null,null,null,null,"G1","PFC-4-1-12 (fire suppression fixed - total stock volume)","G1-PFC-4-1-12 (fire suppression fixed - total stock volume)","KG",213.75,0.21375,null,null,null,null,8550,2.5000000000000001E-2]
[null,null,null,null,null,null,null,null,null,null,null,null,null,null,null,null,null,null,null,null,null,null,null,null,null,null,null,null,null,null,null,null,null,null,null,null,null,null,null,null,null,null,null,null,null,null,null,null,null,null,null,null,null,null,null,null,null,null,null,null,null,null,null,"G1","PFC-5-1-14 (fire suppression fixed - total stock volume)","G1-PFC-5-1-14 (fire suppression fixed - total stock volume)","KG",197.75,0.19775000000000001,null,null,null,null,7910,2.5000000000000001E-2]
[null,null,null,null,null,null,null,null,null,null,null,null,null,null,null,null,null,null,null,null,null,null,null,null,null,null,null,null,null,null,null,null,null,null,null,null,null,null,null,null,null,null,null,null,null,null,null,null,null,null,null,null,null,null,null,null,null,null,null,null,null,null,null,"G1","PFC-9-1-18 (fire suppression fixed - total stock volume)","G1-PFC-9-1-18 (fire suppression fixed - total stock volume)","KG",179.75000000000003,0.17975000000000002,null,null,null,null,7190.0000000000009,2.5000000000000001E-2]
[null,null,null,null,null,null,null,null,null,null,null,null,null,null,null,null,null,null,null,null,null,null,null,null,null,null,null,null,null,null,null,null,null,null,null,null,null,null,null,null,null,null,null,null,null,null,null,null,null,null,null,null,null,null,null,null,null,null,null,null,null,null,null,"G1","CO2 (fire suppression portable - total stock volume)","G1-CO2 (fire suppression portable - total stock volume)","KG",{"$f":"BV99*BW99","v":3.5000000000000003E-2},3.5000000000000004E-5,null,null,null,null,1,3.5000000000000003E-2]
[null,null,null,null,null,null,null,null,null,null,null,null,null,null,null,null,null,null,null,null,null,null,null,null,null,null,null,null,null,null,null,null,null,null,null,null,null,null,null,null,null,null,null,null,null,null,null,null,null,null,null,null,null,null,null,null,null,null,null,null,null,null,null,"G1","HFC-23 (fire suppression portable - total stock volume)","G1-HFC-23 (fire suppression portable - total stock volume)","KG",434.00000000000006,0.43400000000000005,null,null,null,null,12400,3.5000000000000003E-2]
[null,null,null,null,null,null,null,null,null,null,null,null,null,null,null,null,null,null,null,null,null,null,null,null,null,null,null,null,null,null,null,null,null,null,null,null,null,null,null,null,null,null,null,null,null,null,null,null,null,null,null,null,null,null,null,null,null,null,null,null,null,null,null,"G1","HFC-32 (fire suppression portable - total stock volume)","G1-HFC-32 (fire suppression portable - total stock volume)","KG",23.695000000000004,2.3695000000000004E-2,null,null,null,null,677,3.5000000000000003E-2]
[null,null,null,null,null,null,null,null,null,null,null,null,null,null,null,null,null,null,null,null,null,null,null,null,null,null,null,null,null,null,null,null,null,null,null,null,null,null,null,null,null,null,null,null,null,null,null,null,null,null,null,null,null,null,null,null,null,null,null,null,null,null,null,"G1","HFC-41 (fire suppression portable - total stock volume)","G1-HFC-41 (fire suppression portable - total stock volume)","KG",4.0600000000000005,4.0600000000000002E-3,null,null,null,null,116,3.5000000000000003E-2]
[null,null,null,null,null,null,null,null,null,null,null,null,null,null,null,null,null,null,null,null,null,null,null,null,null,null,null,null,null,null,null,null,null,null,null,null,null,null,null,null,null,null,null,null,null,null,null,null,null,null,null,null,null,null,null,null,null,null,null,null,null,null,null,"G1","HFC-43-10mee (fire suppression portable - total stock volume)","G1-HFC-43-10mee (fire suppression portable - total stock volume)","KG",57.750000000000007,5.775000000000001E-2,null,null,null,null,1650,3.5000000000000003E-2]
[null,null,null,null,null,null,null,null,null,null,null,null,null,null,null,null,null,null,null,null,null,null,null,null,null,null,null,null,null,null,null,null,null,null,null,null,null,null,null,null,null,null,null,null,null,null,null,null,null,null,null,null,null,null,null,null,null,null,null,null,null,null,null,"G1","HFC-125 (fire suppression portable - total stock volume)","G1-HFC-125 (fire suppression portable - total stock volume)","KG",110.95000000000003,0.11095000000000003,null,null,null,null,3170.0000000000005,3.5000000000000003E-2]
[null,null,null,null,null,null,null,null,null,null,null,null,null,null,null,null,null,null,null,null,null,null,null,null,null,null,null,null,null,null,null,null,null,null,null,null,null,null,null,null,null,null,null,null,null,null,null,null,null,null,null,null,null,null,null,null,null,null,null,null,null,null,null,"G1","HFC-134 (fire suppression portable - total stock volume)","G1-HFC-134 (fire suppression portable - total stock volume)","KG",39.200000000000003,3.9200000000000006E-2,null,null,null,null,1120,3.5000000000000003E-2]
[null,null,null,null,null,null,null,null,null,null,null,null,null,null,null,null,null,null,null,null,null,null,null,null,null,null,null,null,null,null,null,null,null,null,null,null,null,null,null,null,null,null,null,null,null,null,null,null,null,null,null,null,null,null,null,null,null,null,null,null,null,null,null,"G1","HFC-134a (fire suppression portable - total stock volume)","G1-HFC-134a (fire suppression portable - total stock volume)","KG",45.500000000000007,4.5500000000000006E-2,null,null,null,null,1300,3.5000000000000003E-2]
[null,null,null,null,null,null,null,null,null,null,null,null,null,null,null,null,null,null,null,null,null,null,null,null,null,null,null,null,null,null,null,null,null,null,null,null,null,null,null,null,null,null,null,null,null,null,null,null,null,null,null,null,null,null,null,null,null,null,null,null,null,null,null,"G1","HFC-143 (fire suppression portable - total stock volume)",{"$f":"BL107& \"-\"&BM107","v":"G1-HFC-143 (fire suppression portable - total stock volume)"},"KG",11.48,{"$f":"BP107/1000","v":1.1480000000000001E-2},null,null,null,null,328,3.5000000000000003E-2]
[null,null,null,null,null,null,null,null,null,null,null,null,null,null,null,null,null,null,null,null,null,null,null,null,null,null,null,null,null,null,null,null,null,null,null,null,null,null,null,null,null,null,null,null,null,null,null,null,null,null,null,null,null,null,null,null,null,null,null,null,null,null,null,"G1","HFC-143a (fire suppression portable - total stock volume)","G1-HFC-143a (fire suppression portable - total stock volume)","KG",168.00000000000003,0.16800000000000004,null,null,null,null,4800,3.5000000000000003E-2]
[null,null,null,null,null,null,null,null,null,null,null,null,null,null,null,null,null,null,null,null,null,null,null,null,null,null,null,null,null,null,null,null,null,null,null,null,null,null,null,null,null,null,null,null,null,null,null,null,null,null,null,null,null,null,null,null,null,null,null,null,null,null,null,"G1","HFC-152a (fire suppression portable - total stock volume)","G1-HFC-152a (fire suppression portable - total stock volume)","KG",4.83,4.8300000000000001E-3,null,null,null,null,138,3.5000000000000003E-2]
[null,null,null,null,null,null,null,null,null,null,null,null,null,null,null,null,null,null,null,null,null,null,null,null,null,null,null,null,null,null,null,null,null,null,null,null,null,null,null,null,null,null,null,null,null,null,null,null,null,null,null,null,null,null,null,null,null,null,null,null,null,null,null,"G1","HFC-227ea (fire suppression portable - total stock volume)","G1-HFC-227ea (fire suppression portable - total stock volume)","KG",117.25000000000001,0.11725000000000002,null,null,null,null,3350,3.5000000000000003E-2]
[null,null,null,null,null,null,null,null,null,null,null,null,null,null,null,null,null,null,null,null,null,null,null,null,null,null,null,null,null,null,null,null,null,null,null,null,null,null,null,null,null,null,null,null,null,null,null,null,null,null,null,null,null,null,null,null,null,null,null,null,null,null,null,"G1","HFC-236fa (fire suppression portable - total stock volume)","G1-HFC-236fa (fire suppression portable - total stock volume)","KG",282.10000000000002,0.28210000000000002,null,null,null,null,8060,3.5000000000000003E-2]
[null,null,null,null,null,null,null,null,null,null,null,null,null,null,null,null,null,null,null,null,null,null,null,null,null,null,null,null,null,null,null,null,null,null,null,null,null,null,null,null,null,null,null,null,null,null,null,null,null,null,null,null,null,null,null,null,null,null,null,null,null,null,null,"G1","HFC-245ca (fire suppression portable - total stock volume)","G1-HFC-245ca (fire suppression portable - total stock volume)","KG",25.060000000000002,2.5060000000000002E-2,null,null,null,null,716,3.5000000000000003E-2]
[null,null,null,null,null,null,null,null,null,null,null,null,null,null,null,null,null,null,null,null,null,null,null,null,null,null,null,null,null,null,null,null,null,null,null,null,null,null,null,null,null,null,null,null,null,null,null,null,null,null,null,null,null,null,null,null,null,null,null,null,null,null,null,"G1","HFC-245fa (fire suppression portable - total stock volume)","G1-HFC-245fa (fire suppression portable - total stock volume)","KG",30.03,3.0030000000000001E-2,null,null,null,null,858,3.5000000000000003E-2]
[null,null,null,null,null,null,null,null,null,null,null,null,null,null,null,null,null,null,null,null,null,null,null,null,null,null,null,null,null,null,null,null,null,null,null,null,null,null,null,null,null,null,null,null,null,null,null,null,null,null,null,null,null,null,null,null,null,null,null,null,null,null,null,"G1","HFC-365mfc (fire suppression portable - total stock volume)","G1-HFC-365mfc (fire suppression portable - total stock volume)","KG",28.140000000000004,2.8140000000000005E-2,null,null,null,null,804,3.5000000000000003E-2]
[null,null,null,null,null,null,null,null,null,null,null,null,null,null,null,null,null,null,null,null,null,null,null,null,null,null,null,null,null,null,null,null,null,null,null,null,null,null,null,null,null,null,null,null,null,null,null,null,null,null,null,null,null,null,null,null,null,null,null,null,null,null,null,"G1","PFC-14 (fire suppression portable - total stock volume)","G1-PFC-14 (fire suppression portable - total stock volume)","KG",232.04999999999998,0.23204999999999998,null,null,null,null,6629.9999999999991,3.5000000000000003E-2]
[null,null,null,null,null,null,null,null,null,null,null,null,null,null,null,null,null,null,null,null,null,null,null,null,null,null,null,null,null,null,null,null,null,null,null,null,null,null,null,null,null,null,null,null,null,null,null,null,null,null,null,null,null,null,null,null,null,null,null,null,null,null,null,"G1","PFC-116 (fire suppression portable - total stock volume)","G1-PFC-116 (fire suppression portable - total stock volume)","KG",388.50000000000006,0.38850000000000007,null,null,null,null,11100,3.5000000000000003E-2]
[null,null,null,null,null,null,null,null,null,null,null,null,null,null,null,null,null,null,null,null,null,null,null,null,null,null,null,null,null,null,null,null,null,null,null,null,null,null,null,null,null,null,null,null,null,null,null,null,null,null,null,null,null,null,null,null,null,null,null,null,null,null,null,"G1","PFC-218 (fire suppression portable - total stock volume)","G1-PFC-218 (fire suppression portable - total stock volume)","KG",311.50000000000006,0.31150000000000005,null,null,null,null,8900,3.5000000000000003E-2]
[null,null,null,null,null,null,null,null,null,null,null,null,null,null,null,null,null,null,null,null,null,null,null,null,null,null,null,null,null,null,null,null,null,null,null,null,null,null,null,null,null,null,null,null,null,null,null,null,null,null,null,null,null,null,null,null,null,null,null,null,null,null,null,"G1","PFC-318 (fire suppression portable - total stock volume)","G1-PFC-318 (fire suppression portable - total stock volume)","KG",333.90000000000003,0.33390000000000003,null,null,null,null,9540,3.5000000000000003E-2]
[null,null,null,null,null,null,null,null,null,null,null,null,null,null,null,null,null,null,null,null,null,null,null,null,null,null,null,null,null,null,null,null,null,null,null,null,null,null,null,null,null,null,null,null,null,null,null,null,null,null,null,null,null,null,null,null,null,null,null,null,null,null,null,"G1","PFC-3-1-10 (fire suppression portable - total stock volume)","G1-PFC-3-1-10 (fire suppression portable - total stock volume)","KG",322.00000000000006,0.32200000000000006,null,null,null,null,9200,3.5000000000000003E-2]
[null,null,null,null,null,null,null,null,null,null,null,null,null,null,null,null,null,null,null,null,null,null,null,null,null,null,null,null,null,null,null,null,null,null,null,null,null,null,null,null,null,null,null,null,null,null,null,null,null,null,null,null,null,null,null,null,null,null,null,null,null,null,null,"G1","PFC-4-1-12 (fire suppression portable - total stock volume)","G1-PFC-4-1-12 (fire suppression portable - total stock volume)","KG",299.25000000000006,0.29925000000000007,null,null,null,null,8550,3.5000000000000003E-2]
[null,null,null,null,null,null,null,null,null,null,null,null,null,null,null,null,null,null,null,null,null,null,null,null,null,null,null,null,null,null,null,null,null,null,null,null,null,null,null,null,null,null,null,null,null,null,null,null,null,null,null,null,null,null,null,null,null,null,null,null,null,null,null,"G1","PFC-5-1-14 (fire suppression portable - total stock volume)","G1-PFC-5-1-14 (fire suppression portable - total stock volume)","KG",276.85000000000002,0.27685000000000004,null,null,null,null,7910,3.5000000000000003E-2]
[null,null,null,null,null,null,null,null,null,null,null,null,null,null,null,null,null,null,null,null,null,null,null,null,null,null,null,null,null,null,null,null,null,null,null,null,null,null,null,null,null,null,null,null,null,null,null,null,null,null,null,null,null,null,null,null,null,null,null,null,null,null,null,"G1","PFC-9-1-18 (fire suppression portable - total stock volume)","G1-PFC-9-1-18 (fire suppression portable - total stock volume)","KG",251.65000000000006,0.25165000000000004,null,null,null,null,7190.0000000000009,3.5000000000000003E-2]
[null,null,null,null,null,null,null,null,null,null,null,null,null,null,null,null,null,null,null,null,null,null,null,null,null,null,null,null,null,null,null,null,null,null,null,null,null,null,null,null,null,null,null,null,null,null,null,null,null,null,null,null,null,null,null,null,null,null,null,null,null,null,null,"G1","SF6 (electrical equipment - total stock volume)","G1-SF6 (electrical equipment - total stock volume)","KG",209.15,0.20915,null,null,null,null,23500,8.8999999999999999E-3]
[null,null,null,null,null,null,null,null,null,null,null,null,null,null,null,null,null,null,null,null,null,null,null,null,null,null,null,null,null,null,null,null,null,null,null,null,null,null,null,null,null,null,null,null,null,null,null,null,null,null,null,null,null,null,null,null,null,null,null,null,null,null,null,"G1","NF3 (electrical equipment - total stock volume)","G1-NF3 (electrical equipment - total stock volume)","KG",143.29,0.14329,null,null,null,null,16100,8.8999999999999999E-3]
[null,null,null,null,null,null,null,null,null,null,null,null,null,null,null,null,null,null,null,null,null,null,null,null,null,null,null,null,null,null,null,null,null,null,null,null,null,null,null,null,null,null,null,null,null,null,null,null,null,null,null,null,null,null,null,null,null,null,null,null,null,null,null,"G1","HFC-23 (electrical equipment - total stock volume)",{"$f":"BL125& \"-\"&BM125","v":"G1-HFC-23 (electrical equipment - total stock volume)"},"KG",1116,{"$f":"BP125/1000","v":1.1160000000000001},null,null,null,null,12400,0.09]
[null,null,null,null,null,null,null,null,null,null,null,null,null,null,null,null,null,null,null,null,null,null,null,null,null,null,null,null,null,null,null,null,null,null,null,null,null,null,null,null,null,null,null,null,null,null,null,null,null,null,null,null,null,null,null,null,null,null,null,null,null,null,null,"G1","HFC-32 (electrical equipment - total stock volume)","G1-HFC-32 (electrical equipment - total stock volume)","KG",60.93,6.0929999999999998E-2,null,null,null,null,677,0.09]
[null,null,null,null,null,null,null,null,null,null,null,null,null,null,null,null,null,null,null,null,null,null,null,null,null,null,null,null,null,null,null,null,null,null,null,null,null,null,null,null,null,null,null,null,null,null,null,null,null,null,null,null,null,null,null,null,null,null,null,null,null,null,null,"G1","HFC-41 (electrical equipment - total stock volume)","G1-HFC-41 (electrical equipment - total stock volume)","KG",10.44,1.044E-2,null,null,null,null,116,0.09]
[null,null,null,null,null,null,null,null,null,null,null,null,null,null,null,null,null,null,null,null,null,null,null,null,null,null,null,null,null,null,null,null,null,null,null,null,null,null,null,null,null,null,null,null,null,null,null,null,null,null,null,null,null,null,null,null,null,null,null,null,null,null,null,"G1","HFC-43-10mee (electrical equipment - total stock volume)","G1-HFC-43-10mee (electrical equipment - total stock volume)","KG",148.5,0.14849999999999999,null,null,null,null,1650,0.09]
[null,null,null,null,null,null,null,null,null,null,null,null,null,null,null,null,null,null,null,null,null,null,null,null,null,null,null,null,null,null,null,null,null,null,null,null,null,null,null,null,null,null,null,null,null,null,null,null,null,null,null,null,null,null,null,null,null,null,null,null,null,null,null,"G1","HFC-125 (electrical equipment - total stock volume)","G1-HFC-125 (electrical equipment - total stock volume)","KG",285.3,0.2853,null,null,null,null,3170.0000000000005,0.09]
[null,null,null,null,null,null,null,null,null,null,null,null,null,null,null,null,null,null,null,null,null,null,null,null,null,null,null,null,null,null,null,null,null,null,null,null,null,null,null,null,null,null,null,null,null,null,null,null,null,null,null,null,null,null,null,null,null,null,null,null,null,null,null,"G1","HFC-134 (electrical equipment - total stock volume)","G1-HFC-134 (electrical equipment - total stock volume)","KG",100.8,0.1008,null,null,null,null,1120,0.09]
[null,null,null,null,null,null,null,null,null,null,null,null,null,null,null,null,null,null,null,null,null,null,null,null,null,null,null,null,null,null,null,null,null,null,null,null,null,null,null,null,null,null,null,null,null,null,null,null,null,null,null,null,null,null,null,null,null,null,null,null,null,null,null,"G1","HFC-134a (electrical equipment - total stock volume)","G1-HFC-134a (electrical equipment - total stock volume)","KG",117,0.11700000000000001,null,null,null,null,1300,0.09]
[null,null,null,null,null,null,null,null,null,null,null,null,null,null,null,null,null,null,null,null,null,null,null,null,null,null,null,null,null,null,null,null,null,null,null,null,null,null,null,null,null,null,null,null,null,null,null,null,null,null,null,null,null,null,null,null,null,null,null,null,null,null,null,"G1","HFC-143 (electrical equipment - total stock volume)","G1-HFC-143 (electrical equipment - total stock volume)","KG",29.52,2.9520000000000001E-2,null,null,null,null,328,0.09]
[null,null,null,null,null,null,null,null,null,null,null,null,null,null,null,null,null,null,null,null,null,null,null,null,null,null,null,null,null,null,null,null,null,null,null,null,null,null,null,null,null,null,null,null,null,null,null,null,null,null,null,null,null,null,null,null,null,null,null,null,null,null,null,"G1","HFC-143a (electrical equipment - total stock volume)","G1-HFC-143a (electrical equipment - total stock volume)","KG",432,0.432,null,null,null,null,4800,0.09]
[null,null,null,null,null,null,null,null,null,null,null,null,null,null,null,null,null,null,null,null,null,null,null,null,null,null,null,null,null,null,null,null,null,null,null,null,null,null,null,null,null,null,null,null,null,null,null,null,null,null,null,null,null,null,null,null,null,null,null,null,null,null,null,"G1","HFC-152a (electrical equipment - total stock volume)","G1-HFC-152a (electrical equipment - total stock volume)","KG",12.42,1.242E-2,null,null,null,null,138,0.09]
[null,null,null,null,null,null,null,null,null,null,null,null,null,null,null,null,null,null,null,null,null,null,null,null,null,null,null,null,null,null,null,null,null,null,null,null,null,null,null,null,null,null,null,null,null,null,null,null,null,null,null,null,null,null,null,null,null,null,null,null,null,null,null,"G1","HFC-227ea (electrical equipment - total stock volume)","G1-HFC-227ea (electrical equipment - total stock volume)","KG",301.5,0.30149999999999999,null,null,null,null,3350,0.09]
[null,null,null,null,null,null,null,null,null,null,null,null,null,null,null,null,null,null,null,null,null,null,null,null,null,null,null,null,null,null,null,null,null,null,null,null,null,null,null,null,null,null,null,null,null,null,null,null,null,null,null,null,null,null,null,null,null,null,null,null,null,null,null,"G1","HFC-236fa (electrical equipment - total stock volume)","G1-HFC-236fa (electrical equipment - total stock volume)","KG",725.4,0.72539999999999993,null,null,null,null,8060,0.09]
[null,null,null,null,null,null,null,null,null,null,null,null,null,null,null,null,null,null,null,null,null,null,null,null,null,null,null,null,null,null,null,null,null,null,null,null,null,null,null,null,null,null,null,null,null,null,null,null,null,null,null,null,null,null,null,null,null,null,null,null,null,null,null,"G1","HFC-245ca (electrical equipment - total stock volume)","G1-HFC-245ca (electrical equipment - total stock volume)","KG",64.44,6.4439999999999997E-2,null,null,null,null,716,0.09]
[null,null,null,null,null,null,null,null,null,null,null,null,null,null,null,null,null,null,null,null,null,null,null,null,null,null,null,null,null,null,null,null,null,null,null,null,null,null,null,null,null,null,null,null,null,null,null,null,null,null,null,null,null,null,null,null,null,null,null,null,null,null,null,"G1","HFC-245fa (electrical equipment - total stock volume)","G1-HFC-245fa (electrical equipment - total stock volume)","KG",77.22,7.7219999999999997E-2,null,null,null,null,858,0.09]
[null,null,null,null,null,null,null,null,null,null,null,null,null,null,null,null,null,null,null,null,null,null,null,null,null,null,null,null,null,null,null,null,null,null,null,null,null,null,null,null,null,null,null,null,null,null,null,null,null,null,null,null,null,null,null,null,null,null,null,null,null,null,null,"G1","HFC-365mfc (electrical equipment - total stock volume)","G1-HFC-365mfc (electrical equipment - total stock volume)","KG",72.36,7.2359999999999994E-2,null,null,null,null,804,0.09]
[null,null,null,null,null,null,null,null,null,null,null,null,null,null,null,null,null,null,null,null,null,null,null,null,null,null,null,null,null,null,null,null,null,null,null,null,null,null,null,null,null,null,null,null,null,null,null,null,null,null,null,null,null,null,null,null,null,null,null,null,null,null,null,"G1","PFC-14 (electrical equipment - total stock volume)","G1-PFC-14 (electrical equipment - total stock volume)","KG",596.69999999999993,0.5966999999999999,null,null,null,null,6629.9999999999991,0.09]
[null,null,null,null,null,null,null,null,null,null,null,null,null,null,null,null,null,null,null,null,null,null,null,null,null,null,null,null,null,null,null,null,null,null,null,null,null,null,null,null,null,null,null,null,null,null,null,null,null,null,null,null,null,null,null,null,null,null,null,null,null,null,null,"G1","PFC-116 (electrical equipment - total stock volume)","G1-PFC-116 (electrical equipment - total stock volume)","KG",999,0.999,null,null,null,null,11100,0.09]
[null,null,null,null,null,null,null,null,null,null,null,null,null,null,null,null,null,null,null,null,null,null,null,null,null,null,null,null,null,null,null,null,null,null,null,null,null,null,null,null,null,null,null,null,null,null,null,null,null,null,null,null,null,null,null,null,null,null,null,null,null,null,null,"G1","PFC-218 (electrical equipment - total stock volume)","G1-PFC-218 (electrical equipment - total stock volume)","KG",{"$f":"BV142*BW142","v":801},0.80100000000000005,null,null,null,null,8900,0.09]
[null,null,null,null,null,null,null,null,null,null,null,null,null,null,null,null,null,null,null,null,null,null,null,null,null,null,null,null,null,null,null,null,null,null,null,null,null,null,null,null,null,null,null,null,null,null,null,null,null,null,null,null,null,null,null,null,null,null,null,null,null,null,null,"G1","PFC-318 (electrical equipment - total stock volume)","G1-PFC-318 (electrical equipment - total stock volume)","KG",858.6,0.85860000000000003,null,null,null,null,9540,0.09]
[null,null,null,null,null,null,null,null,null,null,null,null,null,null,null,null,null,null,null,null,null,null,null,null,null,null,null,null,null,null,null,null,null,null,null,null,null,null,null,null,null,null,null,null,null,null,null,null,null,null,null,null,null,null,null,null,null,null,null,null,null,null,null,"G1","PFC-3-1-10 (electrical equipment - total stock volume)","G1-PFC-3-1-10 (electrical equipment - total stock volume)","KG",828,0.82799999999999996,null,null,null,null,9200,0.09]
[null,null,null,null,null,null,null,null,null,null,null,null,null,null,null,null,null,null,null,null,null,null,null,null,null,null,null,null,null,null,null,null,null,null,null,null,null,null,null,null,null,null,null,null,null,null,null,null,null,null,null,null,null,null,null,null,null,null,null,null,null,null,null,"G1","PFC-4-1-12 (electrical equipment - total stock volume)","G1-PFC-4-1-12 (electrical equipment - total stock volume)","KG",769.5,0.76949999999999996,null,null,null,null,8550,0.09]
[null,null,null,null,null,null,null,null,null,null,null,null,null,null,null,null,null,null,null,null,null,null,null,null,null,null,null,null,null,null,null,null,null,null,null,null,null,null,null,null,null,null,null,null,null,null,null,null,null,null,null,null,null,null,null,null,null,null,null,null,null,null,null,"G1","PFC-5-1-14 (electrical equipment - total stock volume)","G1-PFC-5-1-14 (electrical equipment - total stock volume)","KG",711.9,0.71189999999999998,null,null,null,null,7910,0.09]
[null,null,null,null,null,null,null,null,null,null,null,null,null,null,null,null,null,null,null,null,null,null,null,null,null,null,null,null,null,null,null,null,null,null,null,null,null,null,null,null,null,null,null,null,null,null,null,null,null,null,null,null,null,null,null,null,null,null,null,null,null,null,null,"G1","PFC-9-1-18 (electrical equipment - total stock volume)","G1-PFC-9-1-18 (electrical equipment - total stock volume)","KG",647.1,0.64710000000000001,null,null,null,null,7190.0000000000009,0.09]
[null,null,null,null,null,null,null,null,null,null,null,null,null,null,null,null,null,null,null,null,null,null,null,null,null,null,null,null,null,null,null,null,null,null,null,null,null,null,null,null,null,null,null,null,null,null,null,null,null,null,null,null,null,null,null,null,null,null,null,null,null,null,null,"G1","CO2 (other uses through lab or workshop - total flow/consumption volume)",{"$f":"BL148& \"-\"&BM148","v":"G1-CO2 (other uses through lab or workshop - total flow/consumption volume)"},"KG",1,{"$f":"BP148/1000","v":1E-3},null,null,null,null,1,1]
[null,null,null,null,null,null,null,null,null,null,null,null,null,null,null,null,null,null,null,null,null,null,null,null,null,null,null,null,null,null,null,null,null,null,null,null,null,null,null,null,null,null,null,null,null,null,null,null,null,null,null,null,null,null,null,null,null,null,null,null,null,null,null,"G1","CH4 (other uses through lab or workshop - total flow/consumption volume)",{"$f":"BL149& \"-\"&BM149","v":"G1-CH4 (other uses through lab or workshop - total flow/consumption volume)"},"KG",28,{"$f":"BP149/1000","v":2.8000000000000001E-2},null,null,null,null,28,1]
[null,null,null,null,null,null,null,null,null,null,null,null,null,null,null,null,null,null,null,null,null,null,null,null,null,null,null,null,null,null,null,null,null,null,null,null,null,null,null,null,null,null,null,null,null,null,null,null,null,null,null,null,null,null,null,null,null,null,null,null,null,null,null,"G1","N2O (other uses through lab or workshop - total flow/consumption volume)",{"$f":"BL150& \"-\"&BM150","v":"G1-N2O (other uses through lab or workshop - total flow/consumption volume)"},"KG",265,{"$f":"BP150/1000","v":0.26500000000000001},null,null,null,null,265,1]
[null,null,null,null,null,null,null,null,null,null,null,null,null,null,null,null,null,null,null,null,null,null,null,null,null,null,null,null,null,null,null,null,null,null,null,null,null,null,null,null,null,null,null,null,null,null,null,null,null,null,null,null,null,null,null,null,null,null,null,null,null,null,null,"G1","NF3 (other uses through lab or workshop - total flow/consumption volume)",{"$f":"BL151& \"-\"&BM151","v":"G1-NF3 (other uses through lab or workshop - total flow/consumption volume)"},"KG",{"$f":"BV151*BW151","v":16100},{"$f":"BP151/1000","v":16.100000000000001},null,null,null,null,16100,1]
[null,null,null,null,null,null,null,null,null,null,null,null,null,null,null,null,null,null,null,null,null,null,null,null,null,null,null,null,null,null,null,null,null,null,null,null,null,null,null,null,null,null,null,null,null,null,null,null,null,null,null,null,null,null,null,null,null,null,null,null,null,null,null,"G1","HFC-23 (other uses through lab or workshop - total flow/consumption volume)",{"$f":"BL152& \"-\"&BM152","v":"G1-HFC-23 (other uses through lab or workshop - total flow/consumption volume)"},"KG",{"$f":"BV152*BW152","v":12400},{"$f":"BP152/1000","v":12.4},null,null,null,null,12400,1]
[null,null,null,null,null,null,null,null,null,null,null,null,null,null,null,null,null,null,null,null,null,null,null,null,null,null,null,null,null,null,null,null,null,null,null,null,null,null,null,null,null,null,null,null,null,null,null,null,null,null,null,null,null,null,null,null,null,null,null,null,null,null,null,"G1","HFC-32 (other uses through lab or workshop - total flow/consumption volume)","G1-HFC-32 (other uses through lab or workshop - total flow/consumption volume)","KG",677,0.67700000000000005,null,null,null,null,677,1]
[null,null,null,null,null,null,null,null,null,null,null,null,null,null,null,null,null,null,null,null,null,null,null,null,null,null,null,null,null,null,null,null,null,null,null,null,null,null,null,null,null,null,null,null,null,null,null,null,null,null,null,null,null,null,null,null,null,null,null,null,null,null,null,"G1","HFC-41 (other uses through lab or workshop - total flow/consumption volume)","G1-HFC-41 (other uses through lab or workshop - total flow/consumption volume)","KG",116,0.11600000000000001,null,null,null,null,116,1]
[null,null,null,null,null,null,null,null,null,null,null,null,null,null,null,null,null,null,null,null,null,null,null,null,null,null,null,null,null,null,null,null,null,null,null,null,null,null,null,null,null,null,null,null,null,null,null,null,null,null,null,null,null,null,null,null,null,null,null,null,null,null,null,"G1","HFC-43-10mee (other uses through lab or workshop - total flow/consumption volume)","G1-HFC-43-10mee (other uses through lab or workshop - total flow/consumption volume)","KG",1650,1.65,null,null,null,null,1650,1]
[null,null,null,null,null,null,null,null,null,null,null,null,null,null,null,null,null,null,null,null,null,null,null,null,null,null,null,null,null,null,null,null,null,null,null,null,null,null,null,null,null,null,null,null,null,null,null,null,null,null,null,null,null,null,null,null,null,null,null,null,null,null,null,"G1","HFC-125 (other uses through lab or workshop - total flow/consumption volume)","G1-HFC-125 (other uses through lab or workshop - total flow/consumption volume)","KG",3170.0000000000005,3.1700000000000004,null,null,null,null,3170.0000000000005,1]
[null,null,null,null,null,null,null,null,null,null,null,null,null,null,null,null,null,null,null,null,null,null,null,null,null,null,null,null,null,null,null,null,null,null,null,null,null,null,null,null,null,null,null,null,null,null,null,null,null,null,null,null,null,null,null,null,null,null,null,null,null,null,null,"G1","HFC-134 (other uses through lab or workshop - total flow/consumption volume)","G1-HFC-134 (other uses through lab or workshop - total flow/consumption volume)","KG",1120,1.1200000000000001,null,null,null,null,1120,1]
[null,null,null,null,null,null,null,null,null,null,null,null,null,null,null,null,null,null,null,null,null,null,null,null,null,null,null,null,null,null,null,null,null,null,null,null,null,null,null,null,null,null,null,null,null,null,null,null,null,null,null,null,null,null,null,null,null,null,null,null,null,null,null,"G1","HFC-134a (other uses through lab or workshop - total flow/consumption volume)","G1-HFC-134a (other uses through lab or workshop - total flow/consumption volume)","KG",1300,1.3,null,null,null,null,1300,1]
[null,null,null,null,null,null,null,null,null,null,null,null,null,null,null,null,null,null,null,null,null,null,null,null,null,null,null,null,null,null,null,null,null,null,null,null,null,null,null,null,null,null,null,null,null,null,null,null,null,null,null,null,null,null,null,null,null,null,null,null,null,null,null,"G1","HFC-143 (other uses through lab or workshop - total flow/consumption volume)","G1-HFC-143 (other uses through lab or workshop - total flow/consumption volume)","KG",328,0.32800000000000001,null,null,null,null,328,1]
[null,null,null,null,null,null,null,null,null,null,null,null,null,null,null,null,null,null,null,null,null,null,null,null,null,null,null,null,null,null,null,null,null,null,null,null,null,null,null,null,null,null,null,null,null,null,null,null,null,null,null,null,null,null,null,null,null,null,null,null,null,null,null,"G1","HFC-143a (other uses through lab or workshop - total flow/consumption volume)","G1-HFC-143a (other uses through lab or workshop - total flow/consumption volume)","KG",4800,4.8,null,null,null,null,4800,1]
[null,null,null,null,null,null,null,null,null,null,null,null,null,null,null,null,null,null,null,null,null,null,null,null,null,null,null,null,null,null,null,null,null,null,null,null,null,null,null,null,null,null,null,null,null,null,null,null,null,null,null,null,null,null,null,null,null,null,null,null,null,null,null,"G1","HFC-152a (other uses through lab or workshop - total flow/consumption volume)","G1-HFC-152a (other uses through lab or workshop - total flow/consumption volume)","KG",138,0.13800000000000001,null,null,null,null,138,1]
[null,null,null,null,null,null,null,null,null,null,null,null,null,null,null,null,null,null,null,null,null,null,null,null,null,null,null,null,null,null,null,null,null,null,null,null,null,null,null,null,null,null,null,null,null,null,null,null,null,null,null,null,null,null,null,null,null,null,null,null,null,null,null,"G1","HFC-227ea (other uses through lab or workshop - total flow/consumption volume)","G1-HFC-227ea (other uses through lab or workshop - total flow/consumption volume)","KG",3350,3.35,null,null,null,null,3350,1]
[null,null,null,null,null,null,null,null,null,null,null,null,null,null,null,null,null,null,null,null,null,null,null,null,null,null,null,null,null,null,null,null,null,null,null,null,null,null,null,null,null,null,null,null,null,null,null,null,null,null,null,null,null,null,null,null,null,null,null,null,null,null,null,"G1","HFC-236fa (other uses through lab or workshop - total flow/consumption volume)","G1-HFC-236fa (other uses through lab or workshop - total flow/consumption volume)","KG",8060,8.06,null,null,null,null,8060,1]
[null,null,null,null,null,null,null,null,null,null,null,null,null,null,null,null,null,null,null,null,null,null,null,null,null,null,null,null,null,null,null,null,null,null,null,null,null,null,null,null,null,null,null,null,null,null,null,null,null,null,null,null,null,null,null,null,null,null,null,null,null,null,null,"G1","HFC-245ca (other uses through lab or workshop - total flow/consumption volume)","G1-HFC-245ca (other uses through lab or workshop - total flow/consumption volume)","KG",716,0.71599999999999997,null,null,null,null,716,1]
[null,null,null,null,null,null,null,null,null,null,null,null,null,null,null,null,null,null,null,null,null,null,null,null,null,null,null,null,null,null,null,null,null,null,null,null,null,null,null,null,null,null,null,null,null,null,null,null,null,null,null,null,null,null,null,null,null,null,null,null,null,null,null,"G1","HFC-245fa (other uses through lab or workshop - total flow/consumption volume)","G1-HFC-245fa (other uses through lab or workshop - total flow/consumption volume)","KG",858,0.85799999999999998,null,null,null,null,858,1]
[null,null,null,null,null,null,null,null,null,null,null,null,null,null,null,null,null,null,null,null,null,null,null,null,null,null,null,null,null,null,null,null,null,null,null,null,null,null,null,null,null,null,null,null,null,null,null,null,null,null,null,null,null,null,null,null,null,null,null,null,null,null,null,"G1","HFC-365mfc (other uses through lab or workshop - total flow/consumption volume)","G1-HFC-365mfc (other uses through lab or workshop - total flow/consumption volume)","KG",804,0.80400000000000005,null,null,null,null,804,1]
[null,null,null,null,null,null,null,null,null,null,null,null,null,null,null,null,null,null,null,null,null,null,null,null,null,null,null,null,null,null,null,null,null,null,null,null,null,null,null,null,null,null,null,null,null,null,null,null,null,null,null,null,null,null,null,null,null,null,null,null,null,null,null,"G1","PFC-14 (other uses through lab or workshop - total flow/consumption volume)","G1-PFC-14 (other uses through lab or workshop - total flow/consumption volume)","KG",6629.9999999999991,6.629999999999999,null,null,null,null,6629.9999999999991,1]
[null,null,null,null,null,null,null,null,null,null,null,null,null,null,null,null,null,null,null,null,null,null,null,null,null,null,null,null,null,null,null,null,null,null,null,null,null,null,null,null,null,null,null,null,null,null,null,null,null,null,null,null,null,null,null,null,null,null,null,null,null,null,null,"G1","PFC-116 (other uses through lab or workshop - total flow/consumption volume)","G1-PFC-116 (other uses through lab or workshop - total flow/consumption volume)","KG",11100,11.1,null,null,null,null,11100,1]
[null,null,null,null,null,null,null,null,null,null,null,null,null,null,null,null,null,null,null,null,null,null,null,null,null,null,null,null,null,null,null,null,null,null,null,null,null,null,null,null,null,null,null,null,null,null,null,null,null,null,null,null,null,null,null,null,null,null,null,null,null,null,null,"G1","PFC-218 (other uses through lab or workshop - total flow/consumption volume)","G1-PFC-218 (other uses through lab or workshop - total flow/consumption volume)","KG",8900,8.9,null,null,null,null,8900,1]
[null,null,null,null,null,null,null,null,null,null,null,null,null,null,null,null,null,null,null,null,null,null,null,null,null,null,null,null,null,null,null,null,null,null,null,null,null,null,null,null,null,null,null,null,null,null,null,null,null,null,null,null,null,null,null,null,null,null,null,null,null,null,null,"G1","PFC-318 (other uses through lab or workshop - total flow/consumption volume)","G1-PFC-318 (other uses through lab or workshop - total flow/consumption volume)","KG",9540,9.5399999999999991,null,null,null,null,9540,1]
[null,null,null,null,null,null,null,null,null,null,null,null,null,null,null,null,null,null,null,null,null,null,null,null,null,null,null,null,null,null,null,null,null,null,null,null,null,null,null,null,null,null,null,null,null,null,null,null,null,null,null,null,null,null,null,null,null,null,null,null,null,null,null,"G1","PFC-3-1-10 (other uses through lab or workshop - total flow/consumption volume)","G1-PFC-3-1-10 (other uses through lab or workshop - total flow/consumption volume)","KG",9200,9.1999999999999993,null,null,null,null,9200,1]
[null,null,null,null,null,null,null,null,null,null,null,null,null,null,null,null,null,null,null,null,null,null,null,null,null,null,null,null,null,null,null,null,null,null,null,null,null,null,null,null,null,null,null,null,null,null,null,null,null,null,null,null,null,null,null,null,null,null,null,null,null,null,null,"G1","PFC-4-1-12 (other uses through lab or workshop - total flow/consumption volume)","G1-PFC-4-1-12 (other uses through lab or workshop - total flow/consumption volume)","KG",8550,8.5500000000000007,null,null,null,null,8550,1]
[null,null,null,null,null,null,null,null,null,null,null,null,null,null,null,null,null,null,null,null,null,null,null,null,null,null,null,null,null,null,null,null,null,null,null,null,null,null,null,null,null,null,null,null,null,null,null,null,null,null,null,null,null,null,null,null,null,null,null,null,null,null,null,"G1","PFC-5-1-14 (other uses through lab or workshop - total flow/consumption volume)","G1-PFC-5-1-14 (other uses through lab or workshop - total flow/consumption volume)","KG",7910,7.91,null,null,null,null,7910,1]
[null,null,null,null,null,null,null,null,null,null,null,null,null,null,null,null,null,null,null,null,null,null,null,null,null,null,null,null,null,null,null,null,null,null,null,null,null,null,null,null,null,null,null,null,null,null,null,null,null,null,null,null,null,null,null,null,null,null,null,null,null,null,null,"G1","PFC-9-1-18 (other uses through lab or workshop - total flow/consumption volume)","G1-PFC-9-1-18 (other uses through lab or workshop - total flow/consumption volume)","KG",7190.0000000000009,7.1900000000000013,null,null,null,null,7190.0000000000009,1]
[null,null,null,null,null,null,null,null,null,null,null,null,null,null,null,null,null,null,null,null,null,null,null,null,null,null,null,null,null,null,null,null,null,null,null,null,null,null,null,null,null,null,null,null,null,null,null,null,null,null,null,null,null,null,null,null,null,null,null,null,null,null,null,"F2","Anthracite coal",{"$f":"BL175& \"-\"&BM175","v":"F2-Anthracite coal"},"GJ",90.24,{"$f":"BP175/1000","v":9.0240000000000001E-2},null,{"$f":"29/1000","v":2.9000000000000001E-2},null,null,null,null,90,0.04,0.2,{"$f":"BX175/1000","v":0.09},{"$f":"BY175/1000","v":4.0000000000000003E-5},{"$f":"BZ175/1000","v":2.0000000000000001E-4}]
[null,null,null,null,null,null,null,null,null,null,null,null,null,null,null,null,null,null,null,null,null,null,null,null,null,null,null,null,null,null,null,null,null,null,null,null,null,null,null,null,null,null,null,null,null,null,null,null,null,null,null,null,null,null,null,null,null,null,null,null,null,null,null,"F2","Bituminous coal","F2-Bituminous coal","GJ",90.24,9.0240000000000001E-2,null,{"$f":"27/1000","v":2.7E-2},null,null,null,null,90,0.04,0.2,{"$f":"BX176/1000","v":0.09},{"$f":"BY176/1000","v":4.0000000000000003E-5},{"$f":"BZ176/1000","v":2.0000000000000001E-4}]
[null,null,null,null,null,null,null,null,null,null,null,null,null,null,null,null,null,null,null,null,null,null,null,null,null,null,null,null,null,null,null,null,null,null,null,null,null,null,null,null,null,null,null,null,null,null,null,null,null,null,null,null,null,null,null,null,null,null,null,null,null,null,null,"F2","Coal Briquettes","F2-Coal Briquettes","GJ",95.38,9.5379999999999993E-2,null,{"$f":"22.1/1000","v":2.2100000000000002E-2},null,null,null,null,95,0.08,0.3,9.5000000000000001E-2,8.0000000000000007E-5,2.9999999999999997E-4]
[null,null,null,null,null,null,null,null,null,null,null,null,null,null,null,null,null,null,null,null,null,null,null,null,null,null,null,null,null,null,null,null,null,null,null,null,null,null,null,null,null,null,null,null,null,null,null,null,null,null,null,null,null,null,null,null,null,null,null,null,null,null,null,"T3","Anthracite coal","T3-Anthracite coal","GJ",90.24,9.0240000000000001E-2,null,{"$f":"29/1000","v":2.9000000000000001E-2},null,null,null,null,90,0.04,0.2,0.09,4.0000000000000003E-5,2.0000000000000001E-4]
[null,null,null,null,null,null,null,null,null,null,null,null,null,null,null,null,null,null,null,null,null,null,null,null,null,null,null,null,null,null,null,null,null,null,null,null,null,null,null,null,null,null,null,null,null,null,null,null,null,null,null,null,null,null,null,null,null,null,null,null,null,null,null,"T3","Bituminous coal","T3-Bituminous coal","GJ",90.24,9.0240000000000001E-2,null,{"$f":"27/1000","v":2.7E-2},null,null,null,null,90,0.04,0.2,0.09,4.0000000000000003E-5,2.0000000000000001E-4]
[null,null,null,null,null,null,null,null,null,null,null,null,null,null,null,null,null,null,null,null,null,null,null,null,null,null,null,null,null,null,null,null,null,null,null,null,null,null,null,null,null,null,null,null,null,null,null,null,null,null,null,null,null,null,null,null,null,null,null,null,null,null,null,"T3","Coal Briquettes","T3-Coal Briquettes","GJ",95.38,9.5379999999999993E-2,null,{"$f":"22.1/1000","v":2.2100000000000002E-2},null,null,null,null,95,0.08,0.3,9.5000000000000001E-2,8.0000000000000007E-5,2.9999999999999997E-4]